{"text_format":"3","workbook":"xlsx","n_sheets":28,"sheets":["Accueil","Formulaire input","Description des substrats","Formulaire ITK","Caractéristique de installation","Valorisation du biogaz","Valorisation du digestat","Economie circulaireBiodiversité","Parametres","Feuil1","Données projet substrat","Données projet","Calcul AMG","Calculs fonctionnement","Calcul delta","Résultats","Calculs d'impacts","Résultats tableau de bord","Résultats détaillés","Résultats bruts","BDD ITK culture","BDD modélisation ICV","BDD caractérisation substrats","BDD export Ecoinvent - SIMAPRO","Feuille de calcul Flux de matiè","Tableau indicateurs","List1","List"],"not_rendered":{"charts":9,"images":22,"macros":1,"defined_names":215,"comments":4},"read":"whole","date_system":"1900"}

{"sheet":"Accueil","index":0,"n_rows":58,"n_cols":2,"rows_kept":58,"merged":[[18,2,20,4]]}
[]
[null,"DIGES 3 : Digestion anaérobie et gaz à effet de serre "]
[null,"Application pour le calcul du bilan des émissions de gaz à effet de serre des installations de méthanisation\n(en fonctionnement ou en projet)"]
[]
[null,"Préalable : Activation des macros Excel\nL’outil de simulation contenant des macros, il est nécessaire de les activer avant toute simulation. Pour cela, il faut fermer cet Excel, faire un clic droit sur le fichier, cliquer sur propriétés, cocher la case \"débloquer\" dans la section \"sécurité\" en bas de la fenêtre, puis le relancer et ouvrir le fichier du calculateur. Il faudra enfin cliquer sur le bouton \"activer le contenu\" dans le ruban jaune qui s'affiche en haut de la page. Il faut également veiller à saisir les chiffres décimaux avec un séparateur décimal conforme à la configuration de l’ordinateur que vous utilisez (voir Guide Utilisateur)\n"]
[null,"Charte graphique : les cellules des onglets de formulaire avec un fond gris sont modifiables directement, celles avec un fond bleu sont modifiables avec une liste déroulante. Les cellules encadrées en rouge sont nécessaires au calcul des émissions. La navigation se fait à l'aide des onglets à gauche de chaque page. "]
["Guide utilisateur \nGuide méthodologique"]
[null,"DIGES 3 permet de quantifier le bilan des émissions potentielles de Gaz à Effet de Serre (GES) générées par des installations de traitement de substrats par digestion anaérobie au regard des émissions de GES évitées (N2O, CH4 et CO2). Il intègre, en plus de l'évaluation GES, une estimation du stockage de carbone par les cultures intermédiraires à vocation énergétique,  un bilan énergétique, un bilan des flux d'azote, et des indicateurs complémentaires sur économie circulaire et la biodiversité."]
[]
[null,"DIGES 3 considère les émissions de GES et les consommations d'énergie aux étapes :\n\n-\tDe production des substrats cultivés telles que les cultures principales dédiées à la production d’énergie et les cultures intermédiaires à vocation énergétique (CIVE), à travers notamment la consommation de diesel nécessaire au machinisme agricole et à la production et l’usage de fertilisants ;\n-\tDe stockage des effluents d’élevage en amont de leur prise en charge pour leur traitement en unité de méthanisation ;\n-\tDe collecte des substrats en camion depuis leurs gisements jusqu’à l’unité de digestion anaérobie ;\n-\tDe prétraitement des substrats par broyage et hygiénisation ;\n-\tDe digestion anaérobie par les émissions fugitives structurelle de biogaz, les émissions des torchères, et les consommations électriques et thermiques de l’unité ;\n-\tDe gestion du digestat à travers les consommations électriques liées à la séparation des phases, mais aussi par les émissions de GES liées aux configurations de stockage des digestats, leur transport vers le lieu d’épandage et les émissions de GES liées à leur épandage ;\n-\tDe gestion du biogaz pour sa valorisation en cogénération (production d’électricité et/ou de chaleur) ou en épuration et injection (production de biométhane injecté dans le réseau de distribution de gaz de ville pour la production de chaleur ou production de BioGNV ), et cela en comptabilisant les étapes de consommation d’énergies liées aux traitements des gaz et les émissions de GES associées à la combustion et aux imbrûlés du biogaz et du biométhane."]
["Version 1.2"]
{"$rows_empty":34}
[null,"DIGES 3 prend en compte le remplacement des filières de références qui auraient pu être en fonctionnement dans une situation antérieure à l'intsallation de l'unité de méthanisation. Cette prise en compte est également réalisée par substitution. Les filières de références ont été choisis de manière conventionnelle et ne prennent pas en compte les particularités locales. L’outil considère ainsi les émissions évitées de GES :\n\n-\tDes filières de référence de gestion des effluents d’élevage (stockage à l’air libre, épandage et bénéfices initialement fournis en termes de pouvoir fertilisant) ;\n-\tIssues de la consommation de diesel préalablement utilisé pour la production de Cultures Intermédiaires Piège à Nitrates (CIPAN), dans les cas où la culture de CIVE remplace une culture de CIPAN ;\n-\tDes filières de référence de traitement des déchets (incinération, enfouissement, station de traitement de l’eau)  et du transport liés à ces traitements de référence (transport vers l'unité de traitement de référence) ;\n-\tDes filières de référence de production de fertilisants suite à leur substitution par l’usage de digestat sur des cultures (hors CIVE et cultures principales associées au fonctionnement direct de l’unité de méthanisation) ;\n-\tDes filières de référence de production d’énergies (gaz naturel substitué par la chaleur produite par cogénération, mix électrique français substitué par l’électricité produite par cogénération, gaz naturel substitué par la chaleur produite par le biométhane injecté, diesel substitué par le BioGNV) ;\n-\tDu transport de CO2 fossile dans le cas où le CO2 biogénique est capté et liquéfié en sortie de l’étape d’épuration du biogaz en biométhane."]
[]
[]
[null,"Précision sur le module d’estimation du potentiel de stockage de carbone permis par les CIVE et les résultats obtenus :"]
[null,"Un module d’estimation de stockage de carbone est intégré au calculateur. Ce module reprend la méthode de modélisation qui a été appliquée pour le projet CARBOCIMS porté par l’INRAE "]
[null,"Ce module permet, via le modèle AMG (Clivot et al., 2019; Levavasseur et al., 2020), de simuler l'évolution du stock carbone qui est intégrée à long terme à la matière organique du sol à travers l’implantation de CIVE dans une rotation de culture. Cette simulation aboutit à une masse de carbone stocké additionnelle provenant initialement de la photosynthèse, elle est ensuite traduite en masse de CO2 et est mise en perspective du bilan GES. L’inclusion de ce flux de stockage de CO2 au sein du bilan GES de l’unité de méthanisation n’est pas réalisé. "]
[null,"En effet, le flux de stockage futur reste soumis à de fortes hypothèses et certains paramètres agronomiques du modèle ne sont pas modifiables par l’utilisateur par souci de facilité d’usage. Ce flux de stockage est aussi tributaire du maintien des rotations cultures et des itinéraires techniques durant une période de 100 ans, ce qui n’est pas assuré."]
[]
[null,"Contact :"]
[null,"outil.metha@ademe.fr"]
[]
[null,"L’ADEME dispose de la propriété pleine et entière de l’outil DIGES3. DIGES 3 © 2024 by ADEME is licensed under CC BY-ND 4.0 :"]
[null,"https://creativecommons.org/licenses/by-nd/4.0/"]

{"sheet":"Formulaire input","index":1,"n_rows":87,"n_cols":12,"rows_kept":87,"hidden":true}
[{"$nulls":5},"Existe dans DIGES 2"]
[null,"Objectif de l'onglet",{"$nulls":4},"Données spécifiques","Données par défaut","Valeurs à cocher dans des cases","Liste déroulante","Intégrer en version beta et tester pour le péreniser en version finale en l'état ou en valeur par défaut","Pas en paramètre"]
[null,null,"Type de subtrat","Nombre max possible à intégrer au calculateur ?",{"$nulls":7},"Pas un paramètre"]
[{"$nulls":3},"Type de substrat",{"$nulls":5},"X"]
[{"$nulls":3},"Tonnage à l'année de fonctionnement",null,null,"X"]
[{"$nulls":3},"Caractérisation --> valeur par défaut à faire apparaitre --> valeurs spécifiques si connues ?",null,null,"X ?","X"]
[{"$nulls":4},"Conversion d'unité de DIGES 2 en point fort"]
[]
[{"$nulls":3},"Substrat agricoles : paramétrisations poussées --> à faire dans un autre onglet ? Ou apparition automatique des paramètres ?"]
[{"$nulls":4},"ITK",null,"X\nen Litre de diesel par hectare ou :\nnombre de passages par activité, \nPassage de tracteurs\nU-N d'azote épandu\nTraitement phyto ?)",null,"X tracteur au biométhane",null,"Liste des étapes ITK des CIVE à figer, ou juste nombre de passage de tracteur ou litre de diesel"]
[{"$nulls":4},"AMG",null,"8 paramètres de conditions pédoclimatiques : %argile, %CaCO3, pH, C/N (ou choix entre luvisol, calcosol, cambisol ou autre ?), température moyenne annuelle, pluviométrie annuelle, Evapotranspiration potentielle, mm d’irrigation sur la rotation\n\n2 paramètres de type de CIVE : CIVE hiver (modélisé par une céréale),  CIVE été (modélisé par un maïs ensilage), ET rendement en biomasse de la CIVE\n\n2 paramètres de rotation : durée totale de la rotation en année ET place de la CIVE/CIPAN/sol nu dans la rotation (ce paramètre va permettre de déterminer la fréquence d’introduction de ces couvert intermédiaire)\n\n2 paramètres de la culture suivant la CIVE/CIPAN/sol nu : type de culture à choisir parmi blé d’hiver, orge d’hiver, maïs grain, colza, betterave, tournesol, soja, ET le rendement en grain (ou racine pour la betterave) en t MS/ha/an. Ces deux derniers paramètres sont nécessaires puisque des pertes de rendement sur cette culture peuvent être observés et donc un retour au sol moins important de carbone via les résidus de culture.","X (taux d'insertion des CIVE, sol, pluvio comme CARBOCims)",null,null,"Liste de type de sol avec caractérisation %argil, % CaCO3 par défaut ?"]
[{"$nulls":4},"Si présence de CIVE dans les substrats : Culture remplacée par CIVE",{"$nulls":3},"X (sol nu ou CIPAN ou CIMS)"]
[{"$nulls":3},"Filière de référence substituée par substrat : pas en paramètre",{"$nulls":3},"X"]
[{"$nulls":3},"Distance à renseigner","Tout substrat",null,"distance jusqu'au méthaniseur"]
[{"$nulls":4},"Soupe de déconditionnement","Déconditionneur sur place : prendre les distances","distance jusqu'au déconditionneur"]
[{"$nulls":5},"Déconditionneur centralisé","distance entre le déconditionneur et le méthaniseur",null,"Cocher 20 - 30 - 50 km pour les distances amont",null,"OUI"]
[{"$nulls":3},"Distance à renseigner pour la filière de référence substituée",null,null,"distance jusqu'à l'autre centrale de traitement des déchets"]
[]
[]
[null,null,"Caractéristiques de l'installation",null,"Voie Sèche ? STEU ? ISDND ?",{"$nulls":3},"X"]
[{"$nulls":3},"Unité en cogé"]
[{"$nulls":4},"Stockage substrat ?",{"$nulls":3},"Ouvert, couvert, couvert avec récup ?"]
[{"$nulls":4},"Prétraitement par type de substrat ?",null,"X pourcentage pour chaque substrat",null,"broyage\nhygiénisation\ntassement de silo d'ensilage"]
[]
[]
[{"$nulls":4},"Taux de modulation du BMP et temps de séjour hydrolique","Capacité en m3 du digesteur","X"]
[{"$nulls":5},"Capacité en m3 du post-digesteur (si il existe)","X"]
[{"$nulls":5},"Volume occupé par les substrats --> estimation uniquement sur le poids d'eau via la MS","X (si connu, sinon hypothèse volume = poids, données ligne 5)"]
[]
[{"$nulls":4},"Consommation électrique","renseigner source(s) et quantité de MWh si ils sont connus","X (nb de MWh associé à chaque source d'électricité si connus)","X","autoconsommation\nsource exterieur ? mix Fr ou Photovoltaique ou autre ?"]
[{"$nulls":5},"Cocher sur les étapes prises en compte par ces consommations (intègrent-elles le broyage, post-traitement en plus du mélange du digesteur ?)",null,null,"X (broyage/post-traitement ?)"]
[]
[{"$nulls":4},"Consommation thermique","renseigner source et quantité de MWh si ils sont connus","X  (nb de MWh associé à chaque source de chaleur si connus)","X","autoconsommation et/ou source extérieure (gaz naturel ou géothermie)"]
[{"$nulls":5}," étapes prises en compte par ces consommations",null,null,"X (hygiénisation ?)"]
[]
[{"$nulls":4},"Valorisation du biogaz"]
[{"$nulls":5},"rendement élec de la cogé","X si connu","X"]
[{"$nulls":5},"rendement thermique de la cogé (ET part de la chaleur valorisée, en moyenne 51%)","X si connu","X"]
[{"$nulls":5},"Part en autoconsommation","X si connu","X"]
[]
[{"$nulls":5},"Renseigner les productions en kWh elec et thermique à l'année","X","X"]
[{"$nulls":5},"kWh vendu","X","X"]
[{"$nulls":5},"Cela permettra de faire un contrôle de cohérence sur ces grandeurs",{"$nulls":5},"Pas un paramètre : Calcul par défaut avec le taux de modulation du volume de gaz produit"]
[{"$nulls":5},"%autoconsommé, % consommé sur place, %vendu ?","X"]
[{"$nulls":5},"Type d'énergie évité : uniquement mix Fr pour l'élec ?"]
[{"$nulls":5},"Type d'énergie évité : uniquement GN pour le thermique vendu et conso sur place ?",{"$nulls":5},"Pas un paramètre"]
[]
[{"$nulls":3},"Unité en épuration / injection"]
[{"$nulls":4},"Stockage substrat ?","Ouvert, couvert, couvert avec récup ?",null,null,"X (Ouvert, couvert, couvert avec récup ?)"]
[{"$nulls":4},"Prétraitement par type de substrat ?","choix entre broyage hygiénisation…",null,null,"X (broyage, hygiénisation ?)"]
[]
[{"$nulls":4},"taux de modulation du BMP et temps de séjour hydrolique","Capacité en m3 du digesteur","X"]
[{"$nulls":5},"Capacité en m3 du post-digesteur (si il existe)","X"]
[{"$nulls":5},"Volume occupé par les substrats --> estimation uniquement sur le poids d'eau via la MS","X (si connu, sinon hypothèse volume = poids, données ligne 5)"]
[]
[{"$nulls":4},"Consommation électrique"]
[{"$nulls":5},"Epurateur en kWh / Nm3 --> par défaut ?",null,"X"]
[{"$nulls":5},"présence d'une cogé ? Et part du biogaz détourné vers la cogé ?","X (% du biogaz détourné)","X (6%)","X (avec ou sans cogé)"]
[{"$nulls":5},"Rendement de l'épurateur (%) ","X","X (99,3%?)"]
[{"$nulls":5},"membranaire ou PSA ?",null,null,"X (membranaire ou PSA)"]
[{"$nulls":5},"Epurateur --> 61% de l'électricité de l'unité","X","X (61%?)"]
[{"$nulls":5},"Présence d'un oxydateur thermique pour les Off-Gaz",null,null,"X (oxydateur thermique ou non)"]
[{"$nulls":4},"CO2 après épuration","masse de CO2 valorisé par captage","X","X si valorisation mais masse pas connue ?"]
[{"$nulls":5},"Compression liquéfaction ? Consommation élec… --> évitement",{"$nulls":5},"Pas un paramètre"]
[{"$nulls":4},"Biométhane après épuration"]
[{"$nulls":5},"Renseigner les productions injecté dans le réseau en kWh à l'année","X","X"]
[{"$nulls":5},"kWh vendu","X","X"]
[{"$nulls":5},"cela permettra de faire un contrôle de cohérence sur ces grandeurs…"]
[{"$nulls":5},"%autoconsommé, % consommé sur place, %vendu ?","X"]
[]
[{"$nulls":5},"Renseigner les productions de BioGNV en kWh à l'année si station BioGNV sur place","X"]
[]
[{"$nulls":3},"Torchère "]
[]
[{"$nulls":3},"Valorisation du digestat"]
[{"$nulls":4},"Post-traitement digestat","Choix entre presse à visse et centrifugeuse",null,null,"X"]
[{"$nulls":5},"% du digestat brut séparé","X"]
[{"$nulls":5},"% du digestat liquide recirculé","X"]
[]
[{"$nulls":4},"Stockage digestat brut","Ouvert, couvert, couvert avec récup ?",null,null,"X"]
[{"$nulls":4},"Stockage digestat liquide","Ouvert, couvert, couvert avec récup ?",null,null,"X"]
[]
[{"$nulls":4},"distance de transport",null,"X"]
[]
[{"$nulls":4},"Matériel d'épandage principal","Digestat brut",null,null,"X"]
[{"$nulls":5},"Digestat liquide",null,null,"X"]
[{"$nulls":5},"Digestat solide",null,null,"X"]

{"sheet":"Description des substrats","index":2,"n_rows":27,"n_cols":30,"rows_kept":27,"merged":[[0,2,0,3],[6,2,6,3],[9,2,9,3],[11,11,11,19],[15,15,15,16],[15,17,15,18],[15,19,15,29],[24,4,24,5],[25,4,25,5],[26,4,26,5]]}
[]
[null,null,"Nom du projet de méthanisation"]
[null,null,"Année du diagnotic DIGES"]
[null,null,"Type d'installation",null,"Votre choix"]
[null,null,"Type de valorisation énergétique principale",null,"Votre choix"]
[null,null,"Type de voie de digestion",null,"Humide"]
[null,null,"Capacité moyenne annuelle de production de biométhane (Nm3 par heure)"]
[null,null,"Capacité annuelle de production de biométhane (GWh par an)"]
[null,null,"Puissance électrique installée (kWe, si cogénération)"]
[null,null,"Puissance thermique installée (kWth, si cogénération ou chaleur seule)"]
[null,null,"Heures de fonctionnement par an"]
[{"$nulls":11},"Caractérisation des substrats : les données préremplies peuvent être écrasées si des données spécifiques sont disponibles"]
[null,"ACTIONS","Tableau 1 : Informations sur le mélange de substrats pris en charge par le méthaniseur","N° substrat","Catégorie 1","Catégorie 2","Nom du substrat","Tonnage annuel en matière brute (MB) incorporé dans le digesteur","Distance de collecte parcourue jusqu'au méthaniseur (km)","% de camions roulant au bioGNV utilisés pour la collecte","Distance de collecte qui aurait été parcourue pour le traitement du substrat en filière de référence (km)","Taux de matière sèche (% MS/MB)","Taux de matière organique (% MO/MS)","Potentiel méthanogène (Nm3 CH4 / MO), (attention, il ne s'agit pas du potentiel biogaz)","Taux de CH4 dans le biogaz issu du substrat (%vol de CH4)","Teneur en azote total \n(kg/t MB)","Teneur en azote ammoniacal NH4+\n(kg/t MB)","Teneur en phosphore (kg P2O5 / tMB)","Teneur en potassium (kg K2O / tMB)","Teneur en carbone organique total (kg COT/tMB)","Broyage : pourcentage du substrat broyé avant incorporation dans le digesteur (% de la masse du substrat)","Hygiénisation : pourcentage du substrat hygiénisé avant incorporation dans le digesteur (% de la masse du substrat)"]
[]
[]
[{"$nulls":15},"(1) Quantité de carburant spécifique",null,"(2) Choix d'ITK par défaut",null,"(3) ITK spécifique (nombre de passages au champ)"]
[null,null,"Tableau 2 : Paramètres de production pour les substrats végétaux cultivés","N° substrat","Rappel du substrat (Catégorie + Nom)","Rappel du tonnage annuel en matière brute (MB) incorporé dans le digesteur","Rendement de la culture (tMS / ha)","Fertilisation en azote de synthèse (kg unité d'azote appliquée / ha)","Fertilisation en azote organique_lisier fumier (kg unité d'azote appliquée / ha)","Fertilisation en azote organique_digestat (kg unité d'azote appliquée / ha)","Fertilisation en potassium minéral (kg K2O / ha)","Fertilisation en phosphore minéral (kg P2O5 / ha)","Application de produits phytosanitaires (kg de matière active / ha)","Choisir le type de carburant consommé par le tracteur pour cette culture (Diesel/Gazole Non Routier ou BioGNV - le BioGNV peut être sélectionné uniquement pour les installations avec un poste d'épuration)","Cocher \"Consommation énergétique de l'ITK connue\" (1) ou \"choisir un ITK par défaut\" (2) ou \"paramétres de culture connus\" (3)","L de diesel / ha","kg de bioGNV / ha","ITK par défaut","L équivalent de diesel /ha (si le carburant utilisé est du bioGNV, l'équivalence appliquée est de 1 L de diesel = 0,83 kg de diesel = 0,77 kg de biométhane )","Déchaumage","Labour","Reprise (Chisel)","Préparation lit (vibroculteur)","Semis","Fertilisation minérale","Fertilisation organique (hors digestat)","Protection des plantes (épandeur porté)","Récolte (ensileuse)","Transport sur l'exploitation","L équivalent de diesel /ha (si le carburant utilisé est du bioGNV, l'équivalence appliquée dans la suite des calculs est de 1 L de diesel = 0,83 kg de diesel = 0,77 kg de biométhane )"]
[]
[]
[null,null,"Tableau 3 : Paramètres agronomiques pour la production de CIVE (nécessaire entre autre pour l'évaluation du stockage potentiel de carbone)","N° substrat","Rappel du substrat (Catégorie + Nom)","Rappel du tonnage annuel en matière brute (MB) incorporé dans le digesteur","Calcul du stokage de carbone doit-il être mené ? (tous les paramètres de cette ligne doivent être remplis)","La CIVE est cultivée en mélange d'espèce avec au moins 20% de légumineuses","La CIVE est cultivée en remplacement d'une CIPAN ou d'un sol nu","Type de sol","pH du sol","Température moyenne annuelle (°C)","Pluviométrie annuelle (mm/an)","Evapotranspiration annuelle (mm/an)","Irrigation moyenne annuelle sur l'ensemble de la rotation (mm/an)","Nombre d'années de la rotation dans laquelle les CIVE s'intègrent","Année d'intégration de la CIVE dans la rotation (ne peut être supérieur au nombre d'années de la rotation)","Culture principale suivant la CIVE pouvant être impactée sur son rendement","Objectif de rendement initial en grains (ou en racines pour la betterave sucrière) de la cultures principale suivant la CIVE (tMS/ha/an)"]
[]
[null,null,"Cas des soupes de déconditionnement"]
[]
[{"$nulls":3},"Type de déconditionneur ?","Votre choix"]
[{"$nulls":4},"Distance jusqu'au méthaniseur ?",null,0,"km"]
[{"$nulls":4},"Distance moyenne des déchets en amont du déconditionnement ?",null,"Votre choix","km"]
[{"$nulls":4},"Distance entre le déconditionneur et le méthaniseur ?",null,0,"km"]

{"sheet":"Formulaire ITK","index":3,"n_rows":24,"n_cols":24,"rows_kept":24,"hidden":true,"merged":[[8,5,8,8],[8,9,8,10],[8,11,8,20],[9,4,12,4],[10,22,13,22],[10,23,13,23],[13,9,13,10]]}
[]
[]
["Carburant consommé par le tracteur ?","Cocher \"diesel\" ou \"biométhane\"","biométhane"]
[null,"Si biométhane : renseigner les ITK ou les équivalent diesel spécifique pour déterminer les MJ de biométhane autoconsommé"]
[null,null,"diesel",{"$nulls":6},"ITK léger"]
[null,null,"biométhane",null,null,"L de diesel/ha",{"$nulls":3},"ITK moyen"]
[{"$nulls":5},"kg de biométhane/ha",{"$nulls":3},"ITK lourd"]
[]
["Sélectionner pour afficher les substrats avec un amont agricole --> cultures dédiées et CIVE",{"$nulls":4},"(1) L de diesel/ha ou kg de biométhane/ha spécifique",{"$nulls":3},"(2) Liste déroulante: ITK par défaut léger, moyen, lourd",null,"(3) Renseigner le nombre de passages"]
["n° substrat","Nom du substrat","Surface de culture (ha)","Rendement de culture (tMS / ha)","Cocher \"Consommation énergétique de l'ITK connue\" (1) ou \"choisir un ITK par défaut\" (3) ou \"paramétres de culture connus\" (2)","Unité","Quantité/ha","kg de diesel","kg de biométhane","ITK par défaut","kg équivalent de diesel","Déchaumage","Labour","Reprise (Chisel)","Préparation lit (vibroculteur)","Semis","Fertilisation","Protection des plantes (épandeur porté)","Récolte (ensileuse)","Broyage","Transport sur l'exploitation","Calcul kg équivalent de diesel","TOTAL des consommations de diesel (t)","TOTAL des consommations de biométhane (t)"]
["Substrat 4",null,10,7,{"$nulls":3},{"$f":"IF(F11=\"L de diesel/ha\",G11*0.83*C11,\"\")","v":""},{"$f":"IF(F11=\"kg de biométhane/ha\",G11*'BDD modélisation ICV'!A$142*C11,\"\")","v":""},null,{"$f":"IF(J11=\"ITK léger\",'BDD ITK culture'!N$17*C11,IF(J11=\"ITK moyen\",'BDD ITK culture'!N$18*C11,IF(J11=\"ITK lourd\",'BDD ITK culture'!N$19*C11,\"\")))","v":""},0,1,1,0,1,0,0,1,0,1,{"$f":"(L11*'BDD ITK culture'!D$13+M11*'BDD ITK culture'!E$13+N11*'BDD ITK culture'!F$13+O11*'BDD ITK culture'!G$13+P11*'BDD ITK culture'!H$13+Q11*'BDD ITK culture'!I$13+R11*'BDD ITK culture'!K$13+S11*'BDD ITK culture'!L$13+T11*'BDD ITK culture'!#REF!+U11*'BDD ITK culture'!M$13)*C11","v":{"$error":"#REF!"}},{"$f":"IF(C3=\"diesel\",(H14+J14+V14)/1000,0)","v":{"v":0,"d":"0.00"}},{"$f":"IF(C3=\"biométhane\",(I14+(J14+V14)*'BDD modélisation ICV'!A147)/1000,0)","v":{"$error":"#REF!"}}]
["Substrat 6",null,10,6,{"$nulls":3},{"$f":"IF(F12=\"L de diesel/ha\",G12*0.83*C12,\"\")","v":""},{"$f":"IF(F12=\"kg de biométhane/ha\",G12*'BDD modélisation ICV'!A$142*C12,\"\")","v":""},"ITK lourd",{"$f":"IF(J12=\"ITK léger\",'BDD ITK culture'!N$17*C12,IF(J12=\"ITK moyen\",'BDD ITK culture'!N$18*C12,IF(J12=\"ITK lourd\",'BDD ITK culture'!N$19*C12,\"\")))","v":808.4000000000001},{"$nulls":10},{"$f":"L12*'BDD ITK culture'!D$13+M12*'BDD ITK culture'!E$13+N12*'BDD ITK culture'!F$13+O12*'BDD ITK culture'!G$13+P12*'BDD ITK culture'!H$13+Q12*'BDD ITK culture'!I$13+R12*'BDD ITK culture'!K$13+S12*'BDD ITK culture'!L$13+T12*'BDD ITK culture'!#REF!+U12*'BDD ITK culture'!M$13","v":{"$error":"#REF!"}}]
["Substrat 7",null,10,6,null,"kg de biométhane/ha",56,{"$f":"IF(F13=\"L de diesel/ha\",G13*0.83*C13,\"\")","v":""},{"$f":"IF(F13=\"kg de biométhane/ha\",G13*C13,\"\")","v":{"v":560,"d":"560.00"}},null,{"$f":"IF(J13=\"ITK léger\",'BDD ITK culture'!N$17*C13,IF(J13=\"ITK moyen\",'BDD ITK culture'!N$18*C13,IF(J13=\"ITK lourd\",'BDD ITK culture'!N$19*C13,\"\")))","v":""},{"$nulls":10},{"$f":"L13*'BDD ITK culture'!D$13+M13*'BDD ITK culture'!E$13+N13*'BDD ITK culture'!F$13+O13*'BDD ITK culture'!G$13+P13*'BDD ITK culture'!H$13+Q13*'BDD ITK culture'!I$13+R13*'BDD ITK culture'!K$13+S13*'BDD ITK culture'!L$13+T13*'BDD ITK culture'!#REF!+U13*'BDD ITK culture'!M$13","v":{"$error":"#REF!"}}]
["TOTAL",{"$nulls":6},{"$f":"SUM(H11:H13)","v":{"v":0,"d":"0.00"}},{"$f":"SUM(I11:I13)","v":{"v":560,"d":"560.00"}},{"$f":"SUM(K11:K13)","v":808.4000000000001},{"$nulls":11},{"$f":"SUM(V11:V13)","v":{"$error":"#REF!"}}]
[null,"Attention Ensilage"]
[]
[]
[{"$nulls":9},"Paramètre Agronomique (utilisés uniquement pour l'estimation du potentiel de stockage de carbone par les CIVE)"]
["n° substrat","Nom du substrat","Type de CIVE","CIVE en remplacement de CIPAN ou sol nu","Fertilisation en azote de synthèse (kg unité d'azote appliquée / ha)","Fertilisation en azote organique_digestat (kg unité d'azote appliquée / ha)","Fertilisation en oxyde de potassium (kg K2O / ha)","Fertilisation en pentoxyde de phosphore (kg P2O5 / ha)","Application de pesticides (kg / ha)","Type de sol","Température moyenne annuelle","Pluviométrie annuelle (mm / an)","Evapotranspiration annuelle (mm / an)","Irrigation moyenne annuelle sur l'ensemble de la rotation (mm / an)","Nombre d'année de la rotation dans laquelle les CIVE s'intègrent (nombre d'année)","Année d'intégration de la CIVE dans la rotation","Culture principale suivant la CIVE pouvant être impacté sur son rendement","Objectif de rendement initial en grains (ou en racines pour la betterave sucrière) de la culture principale suivante (tMS / ha / an)"]
["Substrat 4",null,"CIVE d'hiver (ensilage céréal immature)","CIPAN",null,"Hors digestat ?",{"$nulls":3},"Calcosol",13.8,638,990,180,2,1,"Tournesol",2.1]
["Substrat 6",null,"CIVE d'été (ensilage de maïs)","CIPAN",{"$nulls":5},"Calcosol",11.5,694,777,0,4,3,"Betterave",16]
["Substrat 7",{"$nulls":8},"Cambisol",11.5,694,777,0,5,3,"Colza",3]
["…"]
[{"$nulls":3},"ITK CIPAN"]

{"sheet":"Caractéristique de installation","index":4,"n_rows":37,"n_cols":6,"rows_kept":37}
[]
[]
[]
[null,"Caractéristiques techniques de l'installation","Volume utile du/des digesteur(s) ? (m3 de remplissage)",0,"m3"]
[null,null,"Présence d'un post-digesteur ?","Votre choix"]
[{"$nulls":3},"Capacité du post-digesteur ? (m3 de remplissage)",0,"m3"]
[null,null,"Présence d'un système de traitement des airs viciés ?","Votre choix"]
[]
[null,"Pratiques visant à limiter les émissions fugitives structurelles de biogaz (hors stockage du digestat, cogénératrice, épurateur, poste d'injection, et l'imbrûlés de méthane de torchère, de cogénératrices, de chaudière, de moteur thermique)","Présence d'une torchère automatique ?","Votre choix"]
[null,null,"Passage annuel d'une caméra IR ?","Votre choix"]
[null,null,"Passage hebdomadaire d'un renifleur de méthane ?","Votre choix"]
[null,null,"Utilisation d'un outil de pilotage pour la bonne gestion de l'alimentation du digesteur ?","Votre choix"]
[null,null,"Maintenance et suivi quotidien des soupapes ?","Votre choix"]
[null,null,"Ronde journalière sur les éléments clés ?","Votre choix"]
[null,null,"Graissage annuel des passages de câbles ?","Votre choix"]
[]
[null,"Pourcentage de biogaz envoyé en torchère","Pourcentage de la production du biogaz envoyé en torchère ? (valeur %)",{"v":0,"d":"0.00%"},"% (s'aider de la calculette ci-dessous, renseigner 0% si la valeur n'est pas connue, la valeur de 1,5% du biogaz produit va alors s'appliquer)"]
[null,null,"Calculette pour le calcul du % de biogaz envoyé en torchère","Heures de fonctionnement annuel de la torchère ?",0,"h"]
[{"$nulls":3},"Débit en biogaz de la torchère (m3 de biogaz/h) ?",0,"m3/h"]
[{"$nulls":3},"Production annuelle de biogaz (Nm3) ?",0,"Nm3"]
[{"$nulls":4},{"$f":"IFERROR(E18*E19/E20,0)","v":{"v":0,"d":"0.0%"}},"Estimation du biogaz envoyé en torchère, en pourcentage"]
[]
[null,"Consommations électriques de l'installation","Source(s) et consommations d'électricité ?"]
[]
[null,null,"Autoconsommation (dont auxiliaires moteurs en cogénération)","Votre choix",0,"MWh"]
[null,null,"Mix électrique français","Votre choix",0,"MWh"]
[null,null,"Photovoltaique","Votre choix",0,"MWh"]
[null,null,"Source inconnue","Votre choix",0,"MWh"]
[null,null,"Etapes prises en compte dans la consommation d'électricité ?","Broyage","Votre choix"]
[{"$nulls":3},"Post traitement (séparation des phases du digestat)","Votre choix"]
[]
[null,"Consommations thermiques de l'installation","Source(s) et consommations thermique ?"]
[null,null,"Autocosommation","Votre choix",0,"MWh"]
[null,null,"Géothermie","Votre choix",0,"MWh"]
[null,null,"Gaz naturel","Votre choix",0,"MWh"]
[null,null,"Source inconnue / Chaleur fatale","Votre choix",0,"MWh"]
[null,null,"Etape d'hygiènisation prise en compte dans la consommation thermique ?","Votre choix"]

{"sheet":"Valorisation du biogaz","index":5,"n_rows":28,"n_cols":6,"rows_kept":28,"merged":[[2,1,2,5],[18,1,18,5]]}
[]
[]
[null,"Rendement de l'installation"]
[null,null,"Existe-il une valorisation du biogaz en injection ou en GNV en complément de la cogénération ?","Votre choix"]
[{"$nulls":3},"Part du biogaz détourné vers un épurateur ?",{"v":0,"d":"0.00%"},"%"]
[]
[null,null,"Type d'épurateur ?","Votre choix"]
[null,null,"Rendement de l'épurateur ?",{"$f":"IF(D7=\"membranaire\",'BDD modélisation ICV'!B48,IF(D7=\"PSA\",'BDD modélisation ICV'!B49,0))","v":{"v":0,"d":"0.00%"}},"% (0 = inconnu)"]
[]
[null,null,"Présence d'un cogénérateur en complément du poste d'épuration ?","Votre choix"]
[{"$nulls":3},"Part du biogaz détourné vers le cogénérateur ?",{"v":0,"d":"0%"},"% (0 = inconnue)"]
[null,null,"Présence d'un oxydateur thermique pour les off-gaz ?","Votre choix"]
[null,null,"Technologie de captage du CO2 ?","Votre choix"]
[{"$nulls":3},"Quantité de CO2 valorisée par captage ?",{"v":0,"d":"0%"},"% (0 =inconnue)"]
[null,null,"Présence d'une station BioGNV sur place ?","Votre choix"]
[{"$nulls":3},"Pourcentage de la production annuelle de biométhane valorisé en BioGNV (usage tracteur et usage transport)?",{"v":0,"d":"0%"},"%"]
[]
[]
[null,"Production énergétique de l'installation"]
[]
[null,null,"Production électrique brute annuelle ?",0,"MWh (0 =inconnue)"]
[null,null,"Si production électrique inconnue :","Rendement électrique brut ?",{"v":0,"d":"0.00%"},"% (0 =inconnu)"]
[]
[null,null,"Production thermique brute annuelle ?",0,"MWh (0 =inconnue)"]
[null,null,"Si production thermique inconnue :","Rendement thermique brut ?",{"v":0,"d":"0.00%"},"% (0 =inconnu)"]
[null,null,"Si production thermique inconnue :","Chaleur valorisée ?",{"v":0,"d":"0.00%"},"% (0 =inconnu)"]
[]
[null,null,"Production brute annuelle de biométhane (injecté dans le réseau et valorisé en BioGNV) ?",0,"MWh (0 =inconnue)"]

{"sheet":"Valorisation du digestat","index":6,"n_rows":20,"n_cols":5,"rows_kept":20,"merged":[[2,1,2,5]]}
[]
[]
[null,"Post-traitement du digestat"]
[]
[null,null,"Système de séparation des phases du digestat ?","Votre choix"]
[{"$nulls":3},"Pourcentage du digestat brut séparé ?",{"v":0,"d":"0.00%"}]
[{"$nulls":3},"Pourcentage du digestat liquide recirculé ?",{"v":0,"d":"0.00%"}]
[{"$nulls":3},"Conditions de stockage du digestat liquide ?","Votre choix"]
[null,null,"Condition principale de stockage du digestat brut ?","Votre choix"]
[null,null,"Distance moyenne de transport du digestat vers le lieu d'épandage ?",0,"km (0 = inconnu)"]
[]
[null,null,"Matériel principal d'épandage pour le digestat brut (pour le calcul de l'abattement de la volatilisation d'ammoniac) ?","Votre choix"]
[{"$nulls":3},"Matériel d'épandage principal pour le digestat liquide ?","Votre choix"]
[{"$nulls":3},"Durée avant incorporation du digestat solide ?","Sans incorporation"]
[]
[]
[]
[]
[]
[{"$nulls":4},"  "]

{"sheet":"Economie circulaireBiodiversité","index":7,"n_rows":40,"n_cols":5,"rows_kept":40}
[]
[]
[]
[]
[]
[]
[null,null,"1. Gestion des cultures - méthanisation agricole"]
[null,null,"seulement si présence de substrats agricoles"]
[null,null,"% de la SAU occupé par les cultures principales dédiées ?",{"v":0,"d":"0.00%"},"%"]
[null,null,"% de la SAU occupé par les CIVE d'été ?",{"v":0,"d":"0.00%"},"%"]
[null,null,"% de la SAU occupé par les CIVE d'hiver ?",{"v":0,"d":"0.00%"},"%"]
[null,null,"% de la SAU occupé par les prairies fauchées pour la méthanisation ?",{"v":0,"d":"0.00%"},"%"]
[]
[null,null,"2. Gestion des CIVE"]
[null,null,"seulement si présence de CIVE"]
[null,null,"Irrigation des CIVE ?","Votre choix"]
[null,null,"Usage de pesticides sur les CIVE ?","Votre choix"]
[null,null,"Fertilisation minérale des CIVE ?","Votre choix"]
[null,null,"Pratique de techniques culturales simplifiées sur les CIVE ?","Votre choix"]
[null,null,"Au moins une des CIVE est-elle cultivée avec au moins deux espèces végétales différentes ?","Votre choix"]
[]
[null,null,"3. Production agricole"]
[null,null,"seulement si présence de substrats agricoles"]
[null,null,"% de substitution des engrais minéraux sur l'exploitation ?",{"v":0,"d":"0%"},"%"]
[null,null,"L'exploitation a-t-elle obtenu une certification HVE niveau 3 ?","Votre choix"]
[null,null,"L'exploitation a-t-elle obtenu une certification Agriculture Biologique ?","Votre choix"]
[null,null,"L'exploitation a-t-elle réalisé des bilans humiques et/ou des analyses de la qualité des sols ?","Votre choix"]
[]
[null,null,"4. Economie circulaire et Intégration dans le territoire"]
[null,null,"L'installation de méthanisation est-elle gouvernée localement ?","Votre choix"]
[null,null,"A quelle hauteur l'installation de méthanisation est-elle financée / détenue par des acteurs locaux (agriculteurs, collectivités, citoyens, entreprises…) ? (Faible= moins de 20% du capital, moyenne = entre 20 et 50%, forte = plus de 50% du capital)","Votre choix"]
[null,null,"Implication de la collectivité locale dans l'installation de méthanisation (maîtrise directe de l'approvisionnement en biodéchets, achat d'énergie, concertation…) ? (Faible= moins de 20% de l'approvisionnement, moyenne = entre 20 et 50%, forte = plus de 50% de l'approvisionnement)","Votre choix"]
[null,null,"A quelle hauteur le digestat est-il épandu sur les terres des actionnaires agricoles ? (Faible= moins de 20% du digestat, moyenne = entre 20 et 50%, forte = plus de 50% du digestat)","Votre choix"]
[]
[null,null,"5. Plateforme et aménagement du site de méthanisation"]
[null,null,"Surface du site de méthanisation ?",0,"ha"]
[null,null,"Le site de méthanisation est-il installé sur une surface déjà artificialisée ?","Votre choix"]
[null,null,"% de surface au sol imperméabilisée par l'installation ?",{"v":0.8,"d":"80%"},"%"]
[null,null,"L'intégration paysagère suit-elle les préconisations de l'ICPE ?","Votre choix"]
[null,null,"Combien de mètres de linéaires de haies ont été plantés sur l'installation ?",0,"m"]

{"sheet":"Parametres","index":8,"n_rows":50,"n_cols":108,"rows_kept":50}
[]
[null,"Type Installation",null,"Valorisation",null,"Substrats",null,null,"Biomasse agricole animale","Biomasse agricole végétale","Déchets/Résidus de collectivité","Déchets/Résidus d'industrie","Déchets résidus industriels liquides"]
[null,"Votre choix",null,"Votre choix",null,"Votre choix",null,null,"Effluents d'élevage","Cultures principales","Déchets verts","IAA","Autres déchets/résidus industriels liquides"]
[null,"A la ferme",null,"Cogénération",null,"Substrat 1",{"$nulls":3},"Cultures principales déclassées","Biodéchets","Maritime"]
[null,"Centralisée/territoriale",null,"Epuration/injection",null,"Substrat 2",{"$nulls":3},"CIVES","Algues","IAA animales"]
[null,"STEP",null,"Chaleur seule",{"$nulls":5},"Déchets/Résidus","Autres","IAA viande"]
[null,"Industrielle",{"$nulls":7},"Déchets/Résidus de cultures","STEP/STEU","IAA Confiserie/chocolaterie/Pâtisserie"]
[{"$nulls":11},"IAA végétales"]
[{"$nulls":11},"Autres déchets/Résidus d'industrie"]
[]
[null,"Pré Traitement",null,"Caractérisations","Déconditionneur",null,"Distance amont déconditionneur"]
[null,"Broyage",null,"Données spécifiques","Déconditionneur sur place",null,"Votre choix"]
[null,"Hygiènisation",null,"Données par défaut","Déconditionneur centralisé",null,20]
[null,"Tassement de silo d'ensilage",{"$nulls":4},30]
[null,"Aucun",{"$nulls":4},50,{"$nulls":4},{"$f":"SUBSTITUTE(SUBSTITUTE(SUBSTITUTE(G26,\"/\",\"_\"),\" \",\"_\"),\"'\",\"_\")","v":"Biomasse_agricole_végétale"}]
[]
[null,"ITK léger",null,"Votre choix","Votre choix",null,"Votre choix"]
[null,"ITK moyen",null,"Oui","Faible",null,"Diesel","CIVE d'hiver"]
[null,"ITK lourd",null,"Non","Moyenne",null,"BioGNV","CIVE d'été"]
[{"$nulls":3},"Non concerné","Forte",null,null,"Ne pas calculer la quantité de carbone stockée"]
[{"$nulls":3},"Votre choix"]
[{"$nulls":3},"A l'air libre"]
[{"$nulls":3},"Couvert"]
[]
[]
[null,{"$f":"_xlfn.UNIQUE('BDD caractérisation substrats'!A4:A87)","v":"Biomasse agricole animale"},{"$nulls":4},"Biomasse agricole végétale","CIVES","Céréales - Matures"]
[null,"Biomasse agricole végétale "]
[null,"Déchets/Résidus de collectivité"]
[null,"Déchets/Résidus d'industrie"]
[]
[]
[{"$nulls":5},"Paramètres de production pour les substrats agricoles","Substrat 8","Rappel du substrat (Catégorie + Nom)","Rappel du tonnage annuel en matière brute (MB) incorporé dans le digesteur","Rendement de la culture (tMS / ha)","Fertilisation en azote de synthèse (kg unité d'azote appliquée / ha)","Fertilisation en azote organique_lisier fumier (kg unité d'azote appliquée / ha)","Fertilisation en azote organique_digestat (kg unité d'azote appliquée / ha)","Fertilisation en potassium (kg K2O / ha)","Fertilisation en phosphore (kg P2O5 / ha)","Application de produits phytosanitaires (kg de matière active / ha)","Choisir le type de carburant consommé par le tracteur pour cette culture (le biométhane peut être séléectionné uniquement pour les installations avec un poste d'épuration)","Cocher \"Consommation énergétique de l'ITK connue\" (1) ou \"choisir un ITK par défaut\" (3) ou \"paramétres de culture connus\" (2)","L de diesel / ha","kg de biométhane / ha","ITK par défaut","L équivalent de diesel /ha (si le carburant utilisé est du biométhane, l'équivalence appliquée est de 1 L de diesel = 0,83 kg de diesel = 0,77 kg de biométhane )","Déchaumage","Labour","Reprise (Chisel)","Préparation lit (vibroculteur)","Semis","Fertilisation minérale","Fertilisation organique","Protection des plantes (épandeur porté)","Récolte (ensileuse)","Transport sur l'exploitation","L équivalent de diesel /ha (si le carburant utilisé est du biométhane, l'équivalence appliquée est de 1 L de diesel = 0,83 kg de diesel = 0,77 kg de biométhane )"]
[{"$nulls":21},{"$f":"IF($R33=\"ITK simplifié\",'BDD ITK culture'!$N$17,IF($R33=\"ITK moyen\",'BDD ITK culture'!$N$18,IF($R33=\"ITK soutenu\",'BDD ITK culture'!$N$19,0)))","v":0},{"$nulls":10},{"$f":"SUMPRODUCT(W33:AF33,'BDD ITK culture'!$D$13:$M$13)","v":0}]
[]
[{"$nulls":5},"Paramètres agronomiques pour la production de CIVE (nécessaire entre autre pour l'évaluation du stockage potentiel de carbone)","n° substrat","Rappel du substrat (Catégorie + Nom)","Rappel du tonnage annuel en matière brute (MB) incorporé dans le digesteur","Calcul du stockage de carbone ?","La CIVE est cultivée en mélange d'espèce avec au moins 20% de légumineuses","La CIVE est cultivée en remplacement d'une CIPAN ou d'un sol nu","Type de sol","pH du sol","Température moyenne annuelle","Pluviométrie annuelle (mm / an)","Evapotranspiration annuelle (mm / an)","Irrigation moyenne annuelle sur l'ensemble de la rotation (mm / an)","Nombre d'année de la rotation dans laquelle les CIVE s'intègrent (nombre d'année)","Année d'intégration de la CIVE dans la rotation","Cultures principales suivant la CIVE pouvant être impacté sur son rendement","Objectif de rendement initial en grains (ou en racines pour la betterave sucrière) de la Cultures principales suivant la CIVE (tMS / ha / an)"]
[{"$nulls":6},"Substrat 4",null,"renvoie vers la colone déjà rempli, cellule non modifiable","Non"]
[]
[{"$nulls":6},"Substrats","Catégorie du substrat (catégorie 1)","Catégorie du substrat (catégorie 2)","Nom du substrat","Catégorie pour score azote","Quantité (tonnes)","km parcourus","t.km","% de camions roulant au biométhane utilisés pour la collecte","% MS/MB","% MO/MS","Potentiel méthanogène (Nm3 CH4 / t MO)","%vol CH4","Azote total \n(kg/t MB)","Azote NH4+\n(kg/t MB)","P2O5 (kg / tMB)","K2O (kg / tMB)","kgC/tMB","Broyage : pourcentage du substrat broyé avant incorporation dans le digesteur (% de la masse du substrat)","Hygiénisation : pourcentage du substrat hygiénisé avant incorporation dans le digesteur (% de la masse du substrat)","MS (t)","Flux de matière sèche dans le digestat (t MS/an)","MO (t)","Flux de matière organique dans le digestat (t MO/an)","Potentiel méthanogène (Nm3 CH4 / t MB)","CH4 potentiel (Nm3)","CH4 exprimé (Nm3)","CH4 potentiel (kg)","CH4 exprimé (kg)","Potentiel méthanogène (Nm3 CH4 / t MS)","%vol CO2","Potentiel de production de CO2 (Nm3 CO2 / t MB)","CO2 potentiel (Nm3)","CO2 exprimé (Nm3)","CO2 potentiel (kg)","CO2 exprimé (kg)","Biogaz potentiel (Nm3)","Biogaz exprimé (Nm3)","Biogaz potentiel (kg)","Biogaz exprimé (kg)","C biogaz potentiel (kg C)","C biogaz exprimé (kg C)","N total (kg)","NH4+ (kg)","Flux de NH4+ dans le digestat (t NH4+/an)","P2O5 total (kg)","K2O total (kg)","C total (kg)","Taux de minéralisation (%)","Pourcentage de carbone biodégradable (%C_biodeg/C_tot)","Flux de carbone organique dans le digestat (t C/an)","Flux de MB dans le digestat (t)","Vérif MB dans le digestat (sys-métha)","Masse sèche récoltée (avant ensilage)","Rendement de culture (tMS / ha)","hectares","Consommation de diesel évité par les CIVE pour le remplacement de CIPAN (kg / an)","(1) Consommation de diesel à l'hectare (kg / ha / an)","(1) Consommation de biométhane à l'hectare (kg / ha / an)","(2) Consommation de diesel à l'hectare (kg / ha / an)","(2) Consommation de biométhane à l'hectare (kg / ha / an)","(3) Consommation de diesel à l'hectare (kg / ha / an)","(3) Consommation de biométhane à l'hectare (kg / ha / an)","Consommation de diesel à l'hectare (kg / ha / an)","Consommation de biométhane à l'hectare (kg / ha / an)","Consommation de diesel à l'ensilage (kg / an)","Consommation de biométhane à l'ensilage (kg / an)","Consommation de diesel globale (kg / an)","Consommation de biométhane globale (kg / an)","Emissions à 20 ans (kg CO2 eq / an)","Emissions  à 100 ans (kg CO2 eq / an)","Stockage C à 20 ans (tC / ha / an)","Stockage C à 20 ans (tC / an)","Stockage eq CO2 à 20 ans (kg eq CO2 / an)","Stockage C à 100 ans (tC / ha / an) ","Stockage C à 100 ans (tC /an) ","Stockage eq CO2 à 100 ans (kg eq CO2 / an)","Utilisation de fertilisant azoté évitée par les légumineuses cultivée avec des CIVE (kg / an)","Fertilisation N minéral (kg UN)","Fertilisation azote organique - lisier et fumier (kg UN)","Fertilisation azote organique - digestat (kg UN)","Fertilisation K (kg K2O)","Fertilisation P (kg P2O5)","Phytosanitaires (kg)","Pré-stockage effluents d'élevage - avec méthanisation (kg eq CO2 20 ans)","Pré-stockage effluents d'élevage - avec méthanisation (kg eq CO2 100 ans)","km filière de réf","t.km de référence","Filière de traitement de référence","kg CO2 à 20 ans / kg de déchets traités","kg CO2 à 100 ans / kg de déchets traités","kWh fossile et nucléaire / kg de déchets traités","kg CO2 à 20 ans / an","kg CO2 à 100 ans / an","kWh fossile et nucléaire / an","Emission au stockage des effluents (kg eq CO2 20 ans / tMB)","Emission au stockage des effluents (kg eq CO2 100 ans / tMB)","Emission à l'épandage des effluents (kg eq CO2 20 ans / tMB)","Emission à l'épandage des effluents (kg eq CO2 100 ans / tMB)","substitution à l'épandage des effluents (kg eq CO2 20 ans / tMB)","substitution à l'épandage des effluents (kg eq CO2 100 ans / tMB)","substitution à l'épandage des effluents (kWh eq / tMB)"]
[{"$nulls":6},"Substrat 1",{"$nulls":3},{"$f":"VLOOKUP($E39,'BDD caractérisation substrats'!$C$4:$BU$111,4,FALSE)","v":{"$error":"#N/A"}},null,null,{"$f":"L39*M39","v":0},{"$nulls":10},{"v":1,"d":"100%"},{"v":0.5,"d":"50%"},{"$f":"P39*L39","v":0},{"$f":"AD39+AA39-AC39","v":{"$error":"#DIV/0!"}},{"$f":"Q39*AA39","v":0},{"$f":"AC39*(1-BC39)","v":{"$error":"#DIV/0!"}},{"$f":"AJ39*P39","v":{"v":0,"d":"0.0"}},{"$f":"AE39*L39","v":0},{"$f":"AF39*'Données projet'!$B$24","v":{"$error":"#DIV/0!"}},{"$f":"AF39*'BDD modélisation ICV'!$B$131","v":{"v":0,"d":"0.00"}},{"$f":"AH39*'Données projet'!$B$24","v":{"$error":"#DIV/0!"}},{"$f":"R39*Q39","v":0},{"$f":"1-S39","v":{"v":1,"d":"100%"}},{"$f":"AE39*AK39/S39","v":{"$error":"#DIV/0!"}},{"$f":"AL39*L39","v":{"$error":"#DIV/0!"}},{"$f":"AM39*'Données projet'!$B$24","v":{"$error":"#DIV/0!"}},{"$f":"AM39*'BDD modélisation ICV'!$C$131","v":{"$error":"#DIV/0!"}},{"$f":"AO39*'Données projet'!$B$24","v":{"$error":"#DIV/0!"}},{"$f":"AF39+AM39","v":{"$error":"#DIV/0!"}},{"$f":"AG39+AN39","v":{"$error":"#DIV/0!"}},{"$f":"AH39+AO39","v":{"$error":"#DIV/0!"}},{"$f":"AI39+AP39","v":{"$error":"#DIV/0!"}},{"$f":"(AF39+AM39)/0.0224*0.012","v":{"$error":"#DIV/0!"}},{"$f":"(AG39+AN39)/0.0224*0.012","v":{"$error":"#DIV/0!"}},{"$f":"T39*L39","v":0},{"$f":"U39*L39","v":0},{"$f":"AX39/1000+((AW39-AX39)/1000)*BC39","v":{"$error":"#DIV/0!"}},{"$f":"V39*L39","v":0},{"$f":"W39*L39","v":0},{"$f":"X39*L39","v":0},{"$f":"1-(BE39*1000/BB39)","v":{"$error":"#DIV/0!"}},{"$f":"IF(((((AE39+AL39)/0.0224)*0.000012)*1000)/X39>1,1,((((AE39+AL39)/0.0224)*0.000012)*1000)/X39)","v":{"$error":"#DIV/0!"}},{"$f":"(BB39/1000)*(1-BD39*('Données projet'!$B$24))","v":{"$error":"#DIV/0!"}},{"$f":"L39-AG39*'BDD modélisation ICV'!G$131/1000-AN39*'BDD modélisation ICV'!H$131/1000","v":{"$error":"#DIV/0!"}},{"$f":"L39-(AA39-AB39)","v":{"$error":"#DIV/0!"}},{"$f":"IF(OR(I39=\"Cultures principales\",I39=\"CIVE d'été\",I39=\"CIVE d'hiver\"),AA39/0.9,0)","v":{"v":0,"d":"0.00"}},{"$f":"IF(ISNA(_xlfn.XLOOKUP(G39,'Description des substrats'!$D$17:$D$20,'Description des substrats'!$G$17:$G$20)),0,_xlfn.XLOOKUP(G39,'Description des substrats'!$D$17:$D$20,'Description des substrats'!$G$17:$G$20))","v":0},{"$f":"IF(OR(I39=\"Cultures principales\",I39=\"CIVE d'été\",I39=\"CIVE d'hiver\"),BH39/BI39,0)","v":{"v":0,"d":"0.00"}},null,{"$f":"IF(ISNA(_xlfn.XLOOKUP(G39,'Description des substrats'!$D$17:$D$20,'Description des substrats'!$P$17:$P$20)),0,_xlfn.XLOOKUP(G39,'Description des substrats'!$D$17:$D$20,'Description des substrats'!$P$17:$P$20*'BDD modélisation ICV'!$A$135))","v":{"v":0,"d":"0.00"}},{"$f":"IF(ISNA(_xlfn.XLOOKUP(G39,'Description des substrats'!$D$17:$D$20,'Description des substrats'!$Q$17:$Q$20)),0,_xlfn.XLOOKUP(G39,'Description des substrats'!$D$17:$D$20,'Description des substrats'!$Q$17:$Q$20))","v":{"v":0,"d":"0.00"}},{"$f":"IF(ISNA(_xlfn.XLOOKUP(G39,'Description des substrats'!$D$17:$D$20,'Description des substrats'!$N$17:$N$20)),0,IF(_xlfn.XLOOKUP(G39,'Description des substrats'!$D$17:$D$20,'Description des substrats'!$N$17:$N$20)=\"diesel\",_xlfn.XLOOKUP(G39,'Description des substrats'!$D$17:$D$20,'Description des substrats'!$S$17:$S50)*'BDD modélisation ICV'!$A$135,0))","v":{"v":0,"d":"0.00"}},{"$f":"IF(ISNA(_xlfn.XLOOKUP(G39,'Description des substrats'!$D$17:$D$20,'Description des substrats'!$N$17:$N$20)),0,IF(_xlfn.XLOOKUP(G39,'Description des substrats'!$D$17:$D$20,'Description des substrats'!$N$17:$N$20)=\"biométhane\",_xlfn.XLOOKUP(G39,'Description des substrats'!$D$17:$D$20,'Description des substrats'!$S$17:$S$20)*'BDD modélisation ICV'!$A$138,0))","v":{"v":0,"d":"0.00"}},{"$f":"_xlfn.SINGLE(IF(ISNA(_xlfn.XLOOKUP(G39,'Description des substrats'!$D$17:$D$20,'Description des substrats'!$N$17:$N$20)),0,IF(_xlfn.XLOOKUP(G39,'Description des substrats'!$D$17:$D$20,'Description des substrats'!$N$17:$N$20)=\"diesel\",_xlfn.XLOOKUP(G39,'Description des substrats'!$D$17:$D$20,'Description des substrats'!$AD$17:$AE$20)*'BDD modélisation ICV'!$A$135,0)))","v":{"v":0,"d":"0.00"}},{"$f":"IF(ISNA(_xlfn.XLOOKUP(G39,'Description des substrats'!$D$17:$D$20,'Description des substrats'!$N$17:$N$20)),0,IF(_xlfn.XLOOKUP(G39,'Description des substrats'!$D$17:$D$20,'Description des substrats'!$N$17:$N$20)=\"biométhane\",_xlfn.XLOOKUP(G39,'Description des substrats'!$D$17:$D$20,'Description des substrats'!$AD$17:$AE$20)*'BDD modélisation ICV'!$A$138,0))","v":{"v":0,"d":"0.00"}},{"$f":"BL39+BN39+BP39","v":{"v":0,"d":"0.00"}},{"v":0,"d":"0.00"},{"$f":"IF(H39=\"Biomasse agricole végétale\",AA39*'BDD modélisation ICV'!$D$6*'BDD modélisation ICV'!$A$135,0)","v":{"v":0,"d":"0.00"}},{"$f":"BT39*'BDD modélisation ICV'!$A$148","v":{"v":0,"d":"0.00"}},{"$f":"IF(ISNA(_xlfn.XLOOKUP(G39,'Description des substrats'!$D$17:$D$20,'Description des substrats'!$N$17:$N$20)),0,IF(_xlfn.XLOOKUP(G39,'Description des substrats'!$D$17:$D$20,'Description des substrats'!$N$17:$N$20)=\"diesel\",BR39*BJ39+BT39,0))","v":{"v":0,"d":"0.00"}},{"$f":"IF(ISNA(_xlfn.XLOOKUP(G39,'Description des substrats'!$D$17:$D$20,'Description des substrats'!$N$17:$N$20)),0,IF(_xlfn.XLOOKUP(G39,'Description des substrats'!$D$17:$D$20,'Description des substrats'!$N$17:$N$20)=\"biométhane\",BS39*BJ39+BU39,0))","v":{"v":0,"d":"0.00"}},{"$f":"BV39*('BDD export Ecoinvent - SIMAPRO'!$D$8+'BDD export Ecoinvent - SIMAPRO'!$E$8)+BW39*0","v":{"v":0,"d":"0.00"}},{"$f":"BV39*('BDD export Ecoinvent - SIMAPRO'!$D$9+'BDD export Ecoinvent - SIMAPRO'!$E$9)+BW39*0","v":{"v":0,"d":"0.00"}},null,{"$f":"BJ39*BZ39","v":{"v":0,"d":"0.00"}},{"$f":"CA39*44/12","v":{"v":0,"d":"0.00"}},null,{"$f":"CC39*BJ39","v":{"v":0,"d":"0.00"}},{"$f":"CD39*44/12","v":{"v":0,"d":"0.00"}},{"$f":"IF(ISNA(_xlfn.XLOOKUP(G39,'Description des substrats'!$D$20:$D$24,'Description des substrats'!$H$20:$H$24)),0,(IF(_xlfn.XLOOKUP(G39,'Description des substrats'!$D$20:$D$24,'Description des substrats'!$H$20:$H$24)=\"Oui\",BJ39*20,0)))","v":{"v":0,"d":"0.00"}},{"$f":"IF(ISNA(_xlfn.XLOOKUP(G39,'Description des substrats'!$D$17:$D$20,'Description des substrats'!$H$17:$H$20)),0,_xlfn.XLOOKUP(G39,'Description des substrats'!$D$17:$D$20,'Description des substrats'!$H$17:$H$20))","v":{"v":0,"d":"0.00"}},{"$f":"IF(ISNA(_xlfn.XLOOKUP(G39,'Description des substrats'!$D$17:$D$20,'Description des substrats'!$I$17:$I$20)),0,_xlfn.XLOOKUP(G39,'Description des substrats'!$D$17:$D$20,'Description des substrats'!$I$17:$I$20))","v":{"v":0,"d":"0.00"}},{"$f":"IF(ISNA(_xlfn.XLOOKUP(G39,'Description des substrats'!$D$17:$D$20,'Description des substrats'!$J$17:$J$20)),0,_xlfn.XLOOKUP(G39,'Description des substrats'!$D$17:$D$20,'Description des substrats'!$J$17:$J$20))","v":{"v":0,"d":"0.00"}},{"$f":"IF(ISNA(_xlfn.XLOOKUP(G39,'Description des substrats'!$D$17:$D$20,'Description des substrats'!$K$17:$K$20)),0,_xlfn.XLOOKUP(G39,'Description des substrats'!$D$17:$D$20,'Description des substrats'!$K$17:$K$20))","v":{"v":0,"d":"0.00"}},{"$f":"IF(ISNA(_xlfn.XLOOKUP(G39,'Description des substrats'!$D$17:$D$20,'Description des substrats'!$L$17:$L$20)),0,_xlfn.XLOOKUP(G39,'Description des substrats'!$D$17:$D$20,'Description des substrats'!$L$17:$L$20))","v":{"v":0,"d":"0.00"}},{"$f":"IF(ISNA(_xlfn.XLOOKUP(G39,'Description des substrats'!$D$17:$D$20,'Description des substrats'!$M$17:$M$20)),0,_xlfn.XLOOKUP(G39,'Description des substrats'!$D$17:$D$20,'Description des substrats'!$M$17:$M$20))","v":{"v":0,"d":"0.00"}},{"$f":"CX39*8/180*L39","v":{"$error":"#N/A"}},{"$f":"CY39*8/180*L39","v":{"$error":"#N/A"}},{"$f":"'Description des substrats'!P42","v":0},{"$f":"L39*CO39","v":0},{"$f":"VLOOKUP(J39,'BDD caractérisation substrats'!$C$4:$BU$111,16,FALSE)","v":{"$error":"#N/A"}},{"$f":"VLOOKUP(J39,'BDD caractérisation substrats'!$C$4:$BU$111,17,FALSE)","v":{"$error":"#N/A"}},{"$f":"VLOOKUP(J39,'BDD caractérisation substrats'!$C$4:$BU$111,18,FALSE)","v":{"$error":"#N/A"}},{"$f":"VLOOKUP(J39,'BDD caractérisation substrats'!$C$4:$BU$111,19,FALSE)","v":{"$error":"#N/A"}},{"$f":"(CR39+CX39+CZ39+DB39)*L39","v":{"$error":"#N/A"}},{"$f":"(CS39+CY39+DA39+DC39)*L39","v":{"$error":"#N/A"}},{"$f":"(CT39+DD39)*L39","v":{"$error":"#N/A"}},{"$f":"VLOOKUP(J39,'BDD caractérisation substrats'!$C$4:$BU$111,20,FALSE)","v":{"$error":"#N/A"}},{"$f":"VLOOKUP(J39,'BDD caractérisation substrats'!$C$4:$BU$111,21,FALSE)","v":{"$error":"#N/A"}},{"$f":"VLOOKUP(J39,'BDD caractérisation substrats'!$C$4:$BU$111,22,FALSE)","v":{"$error":"#N/A"}},{"$f":"VLOOKUP(J39,'BDD caractérisation substrats'!$C$4:$BU$111,23,FALSE)","v":{"$error":"#N/A"}},{"$f":"VLOOKUP(J39,'BDD caractérisation substrats'!$C$4:$BU$111,24,FALSE)","v":{"$error":"#N/A"}},{"$f":"VLOOKUP(J39,'BDD caractérisation substrats'!$C$4:$BU$111,25,FALSE)","v":{"$error":"#N/A"}},{"$f":"VLOOKUP(J39,'BDD caractérisation substrats'!$C$4:$BU$111,26,FALSE)","v":{"$error":"#N/A"}}]
[]
[]
[]
[{"$nulls":5},"Table S2 Soil characteristics of the first layer (0-25 cm) used in AMG for the different case study",{"$nulls":4},"Table S1: Climate characteristics of thecase studiesfor the reference period (1981-2010)",{"$nulls":3},"Production agricole",{"$nulls":11},"Estimation du stockage potentiel "]
[null,"https://www6.hautsdefrance.inrae.fr/agroimpact/Nos-dispositifs-outils/Modeles-et-outils-d-aide-a-la-decision/AMG-et-SIMEOS-AMG/AMG-model-description",null,"Substrat CIVE numéro","Numéro du cas CIVE (pour l'incrémentation)","Type","Clay (%)","CaCO3 (%)","pH","C:N","Temperature (°C)","Rainfall (mm)","PET (mm)","Irrigation (mm)","Sans métha CC","t DM / ha","Avec métha CC","Rendement CIVE t DM / ha","Place de la culture suivant la CC","Nombre de culture","Nombre d'insertion de CC sur 30 ans","Cultures principaless suivantes","Primary crop following the CC","Crop grain (or root for sugarbeet) yields (tDMha-1) of the primarycrops used in AMG ","Nombre d'insertion de CC sur 100 ans",null,"tC / ha / an à 20 ans","kg CO2 eq / ha / an à 20 ans","tC / ha / an à 30 ans","kg CO2 eq / ha / an à 30 ans","tC / ha / an à 100 ans","kg CO2 eq / ha / an à 100 ans"]
[null,"https://www6.hautsdefrance.inrae.fr/agroimpact/content/download/3760/36367/version/1/file/AMG_detailed_model_description.pdf",null,{"$f":"'Description des substrats'!B28","v":0},1,{"$f":"'Description des substrats'!#REF!","v":{"$error":"#REF!"}},{"$f":"VLOOKUP(F45,$AB$170:$AF$180,2,FALSE)","v":{"$error":"#REF!"}},{"$f":"VLOOKUP(F45,$AB$170:$AF$180,3,FALSE)","v":{"$error":"#REF!"}},8,{"$f":"VLOOKUP(F45,$AB$170:$AF$180,5,FALSE)","v":{"$error":"#REF!"}},{"$f":"'Description des substrats'!#REF!","v":{"$error":"#REF!"}},{"$f":"'Description des substrats'!#REF!","v":{"$error":"#REF!"}},{"$f":"'Description des substrats'!#REF!","v":{"$error":"#REF!"}},{"$f":"'Description des substrats'!#REF!","v":{"$error":"#REF!"}},{"$f":"IF('Description des substrats'!#REF!=\"CIPAN\",\"Mustard\",\"\")","v":{"$error":"#REF!"}},{"$f":"IF(O45=\"Mustard\",2,\"\")","v":{"$error":"#REF!"}},{"$f":"'Description des substrats'!#REF!","v":{"$error":"#REF!"}},{"$f":"'Description des substrats'!#REF!","v":{"$error":"#REF!"}},{"$f":"'Description des substrats'!#REF!","v":{"$error":"#REF!"}},{"$f":"'Description des substrats'!#REF!","v":{"$error":"#REF!"}},{"$f":"30/T45","v":{"$error":"#REF!"}},{"$f":"'Description des substrats'!#REF!","v":{"$error":"#REF!"}},{"$f":"VLOOKUP(V45,$Q$168:$R$174,2,FALSE)","v":{"$error":"#REF!"}},null,{"$f":"100/T45","v":{"$error":"#REF!"}},null,null,{"$f":"IFERROR(-AA45/12*44*1000,0)","v":0},null,{"$f":"IFERROR(-AC45/12*44*1000,0)","v":0},null,{"$f":"IFERROR(-AE45/12*44*1000,0)","v":0},{"$f":"IFERROR(-AF45/12*44*1000,0)","v":0}]
[]
[]
[{"$nulls":11},"Taux de matière sèche (% MS/MB)","Taux de matière organique (% MO/MS)","Potentiel méthanogène (Nm3 CH4 / MO), (attention, il ne s'agit pas du potentiel biogaz)","Taux de CH4 dans le biogaz issu du substrat (%vol de CH4)","Teneur en azote total \n(kg/t MB)","Teneur en azote ammoniacal NH4+\n(kg/t MB)","Teneur en phosphore (kg P2O5 / tMB)","Teneur en potassium (kg K2O / tMB)","Teneur en carbone organique total (kg COT/tMB)","Broyage : pourcentage du substrat broyé avant incorporation dans le digesteur (% de la masse du substrat)","Hygiénisation : pourcentage du substrat hygiénisé avant incorporation dans le digesteur (% de la masse du substrat)"]
[]
[{"$nulls":3},"Substrat 1","Biomasse agricole animale","Effluents d'élevage","Déchets restauration",5000,null,{"v":0,"d":"0.00%"},20,{"$f":"IFERROR(VLOOKUP($G50,'BDD caractérisation substrats'!$C$4:$BU$111,5,FALSE),0)","v":{"v":0.26965,"d":"27%"}},{"$f":"IFERROR(VLOOKUP($G50,'BDD caractérisation substrats'!$C$4:$BU$111,6,FALSE),0)","v":{"v":0.8219,"d":"82%"}},{"$f":"IFERROR(VLOOKUP($G50,'BDD caractérisation substrats'!$C$4:$BU$111,7,FALSE),0)","v":{"v":324.96242216135,"d":"324.96"}},{"$f":"IFERROR(VLOOKUP($G50,'BDD caractérisation substrats'!$C$4:$BU$111,8,FALSE),0)","v":{"v":0.61,"d":"61%"}},{"$f":"IFERROR(VLOOKUP($G50,'BDD caractérisation substrats'!$C$4:$BU$111,9,FALSE),0)","v":{"v":8.085249999999998,"d":"8.09"}},{"$f":"IFERROR(VLOOKUP($G50,'BDD caractérisation substrats'!$C$4:$BU$111,10,FALSE),0)","v":{"v":0.59856,"d":"0.60"}},{"$f":"IFERROR(VLOOKUP($G50,'BDD caractérisation substrats'!$C$4:$BU$111,11,FALSE),0)","v":{"v":2.6549166666666664,"d":"2.65"}},{"$f":"IFERROR(VLOOKUP($G50,'BDD caractérisation substrats'!$C$4:$BU$111,12,FALSE),0)","v":{"v":2.435,"d":"2.44"}},{"$f":"L50*M50*0.45*1000","v":{"v":99.73140074999999,"d":"99.73"}},{"v":1,"d":"100%"},{"v":0,"d":"0%"}]

{"sheet":"Feuil1","index":9,"n_rows":27,"n_cols":10,"rows_kept":27,"hidden":true}
["N° substrat","Nom","% MB","% prod énergétique",{"$nulls":4},"contributive 66"]
["Substrat 2","Bovin - Lisiers autres",{"$f":"'Données projet substrat'!G7/'Données projet substrat'!$G$4","v":{"$error":"#DIV/0!"}},{"$f":"'Données projet substrat'!AB7/'Données projet substrat'!$AB$4","v":{"$error":"#DIV/0!"}},{"$nulls":4},"A","B"]
["Substrat 9","Féculerie/ transformation de pomme de terre",{"$f":"'Données projet substrat'!G14/'Données projet substrat'!$G$4","v":{"$error":"#DIV/0!"}},{"$f":"'Données projet substrat'!AB14/'Données projet substrat'!$AB$4","v":{"$error":"#DIV/0!"}},{"$nulls":4},"Valorisation du digestat (séparation, stockage et épandage)",{"$f":"'Calculs d''impacts'!P$35","v":{"v":0,"d":"0.00"}}]
["Substrat 8","Soupe de déconditionnement",{"$f":"'Données projet substrat'!G13/'Données projet substrat'!$G$4","v":{"$error":"#DIV/0!"}},{"$f":"'Données projet substrat'!AB13/'Données projet substrat'!$AB$4","v":{"$error":"#DIV/0!"}},{"$nulls":4},"Méthaniseur (estimation des émissions fugitives structurelles)",{"$f":"'Calculs d''impacts'!M$35","v":{"v":0,"d":"0.00"}}]
["Substrat 1","Volaille -  Fumier (autres), fientes",{"$f":"'Données projet substrat'!G6/'Données projet substrat'!$G$4","v":{"$error":"#DIV/0!"}},{"$f":"'Données projet substrat'!AB6/'Données projet substrat'!$AB$4","v":{"$error":"#DIV/0!"}},{"$nulls":4},"Valorisation du biogaz en cogénération",{"$f":"'Calculs d''impacts'!N$35","v":{"v":0,"d":"0.00"}}]
["Substrat 4","Céréales immatures, ensilées, non ensilées",{"$f":"'Données projet substrat'!G9/'Données projet substrat'!$G$4","v":{"$error":"#DIV/0!"}},{"$f":"'Données projet substrat'!AB9/'Données projet substrat'!$AB$4","v":{"$error":"#DIV/0!"}},{"$nulls":4},"Stockage des effluents bruts et biodéchets",{"$f":"'Calculs d''impacts'!I$35","v":{"v":0,"d":"0.00"}}]
["Substrat 10","Transformation/conserverie des fruits et légumes",{"$f":"'Données projet substrat'!G15/'Données projet substrat'!$G$4","v":{"$error":"#DIV/0!"}},{"$f":"'Données projet substrat'!AB15/'Données projet substrat'!$AB$4","v":{"$error":"#DIV/0!"}},{"$nulls":4},"Transport des substrats",{"$f":"'Calculs d''impacts'!J$35","v":{"v":0,"d":"0.00"}}]
["Substrat 5","Mélanges - Autres - Immatures , ensilée, non ensilée",{"$f":"'Données projet substrat'!G10/'Données projet substrat'!$G$4","v":{"$error":"#DIV/0!"}},{"$f":"'Données projet substrat'!AB10/'Données projet substrat'!$AB$4","v":{"$error":"#DIV/0!"}},{"$nulls":4},"Méthaniseur",{"$f":"'Calculs d''impacts'!L$35","v":{"v":0,"d":"0.00"}}]
["Substrat 6","Aliments pour animaux (bétails)",{"$f":"'Données projet substrat'!G11/'Données projet substrat'!$G$4","v":{"$error":"#DIV/0!"}},{"$f":"'Données projet substrat'!AB11/'Données projet substrat'!$AB$4","v":{"$error":"#DIV/0!"}},{"$nulls":4},"Valorisation du digestat (transport)",{"$f":"'Calculs d''impacts'!Q$35","v":{"$error":"#VALUE!"}}]
["Substrat 3","Bovin - Fumier",{"$f":"'Données projet substrat'!G8/'Données projet substrat'!$G$4","v":{"$error":"#DIV/0!"}},{"$f":"'Données projet substrat'!AB8/'Données projet substrat'!$AB$4","v":{"$error":"#DIV/0!"}},{"$nulls":4},"Valorisation du biogaz en injection (biométhane et BioGNV)",{"$f":"'Calculs d''impacts'!O$35","v":{"v":0,"d":"0.00"}}]
["Substrat 7","Issus de stockage - céréales",{"$f":"'Données projet substrat'!G12/'Données projet substrat'!$G$4","v":{"$error":"#DIV/0!"}},{"$f":"'Données projet substrat'!AB12/'Données projet substrat'!$AB$4","v":{"$error":"#DIV/0!"}},{"$nulls":4},"Prétraitement",{"$f":"'Calculs d''impacts'!K$35","v":{"v":0,"d":"0.00"}}]
[{"$nulls":8},"Production de substrats cultivés (cultures dédiées)",{"$f":"'Calculs d''impacts'!G$35","v":{"v":0,"d":"0.00"}}]
[{"$nulls":8},"Production de substrats cultivés (CIVE)",{"$f":"'Calculs d''impacts'!H$35","v":{"v":0,"d":"0.00"}}]
[]
[{"$nulls":8},"contributive 25"]
[{"$nulls":8},"A","B"]
[{"$nulls":8},"Méthaniseur (estimation des émissions fugitives structurelles)",{"$f":"'Calculs d''impacts'!M$35","v":{"v":0,"d":"0.00"}}]
[{"$nulls":8},"Valorisation du digestat (séparation, stockage et épandage)",{"$f":"'Calculs d''impacts'!P$37","v":{"v":0,"d":"0.00"}}]
[{"$nulls":8},"Valorisation du biogaz en cogénération",{"$f":"'Calculs d''impacts'!N$37","v":{"v":0,"d":"0.00"}}]
[{"$nulls":8},"Stockage des effluents bruts et biodéchets",{"$f":"'Calculs d''impacts'!I$37","v":{"v":0,"d":"0.00"}}]
[{"$nulls":8},"Transport des substrats",{"$f":"'Calculs d''impacts'!J$37","v":{"v":0,"d":"0.00"}}]
[{"$nulls":8},"Production de substrats cultivés (CIVE)",{"$f":"'Calculs d''impacts'!H$37","v":{"v":0,"d":"0.00"}}]
[{"$nulls":8},"Méthaniseur",{"$f":"'Calculs d''impacts'!L$37","v":{"v":0,"d":"0.00"}}]
[{"$nulls":8},"Valorisation du digestat (transport)",{"$f":"'Calculs d''impacts'!Q$37","v":{"$error":"#VALUE!"}}]
[{"$nulls":8},"Valorisation du biogaz en injection (biométhane et BioGNV)",{"$f":"'Calculs d''impacts'!O$37","v":{"v":0,"d":"0.00"}}]
[{"$nulls":8},"Prétraitement",{"$f":"'Calculs d''impacts'!K$37","v":{"v":0,"d":"0.00"}}]
[{"$nulls":8},"Production de substrats cultivés (cultures dédiées)",{"$f":"'Calculs d''impacts'!G$37","v":{"v":0,"d":"0.00"}}]

{"sheet":"Données projet substrat","index":10,"n_rows":5,"n_cols":103,"rows_kept":5,"hidden":true,"merged":[[2,88,2,99]]}
[null,null,"Si données spécifique --> prendre la données spé --> sinon prendre la données par défaut",{"$nulls":21},"Somme MB des matières Hygiénisation - broyage"]
[]
["1. Liste des substrats",{"$nulls":87},"Filière de référence"]
["TOTAL",{"$f":"COUNTIF(B6:B22,\"Substrat*\")","v":0},{"$nulls":4},{"$f":"SUM(G6:G1150)","v":0},{"$f":"SUMPRODUCT(H6:H1150,G6:G1150)/G4","v":{"$error":"#DIV/0!"}},{"$f":"SUM(I5:I1150)","v":0},{"$f":"SUMPRODUCT(J6:J1150,I6:I1150)","v":0},{"$nulls":3},{"$f":"AA4/(AA4+AH4)","v":{"$error":"#DIV/0!"}},{"$nulls":5},{"$f":"SUMPRODUCT(G6:G1150,T6:T1150)","v":0},{"$f":"SUMPRODUCT(G6:G1150,U6:U1150)","v":0},{"$f":"SUM(V6:V1150)","v":0},{"v":0,"d":"0.00E+00"},0,{"v":0,"d":"0.00E+00"},{"v":0,"d":"0.0"},0,0,0,0,0,0,0,0,0,0,0,0,0,0,0,0,0,0,0,0,0,0,0,0,0,0,0,0,0,null,{"$f":"SUM(BE6:BE1150)","v":{"v":0,"d":"0.00"}},{"$f":"SUM(BF6:BF1150)","v":{"v":0,"d":"0.00"}},{"$nulls":8},{"$f":"SUM(BO6:BO1150)","v":{"v":0,"d":"0.00"}},{"v":0,"d":"0.00"},{"v":0,"d":"0.00"},{"v":0,"d":"0.00"},{"v":0,"d":"0.00"},{"v":0,"d":"0.00"},{"v":0,"d":"0.00"},{"v":0,"d":"0.00"},{"v":0,"d":"0.00"},{"v":0,"d":"0.00"},{"v":0,"d":"0.00"},{"v":0,"d":"0.00"},{"v":0,"d":"0.00"},{"v":0,"d":"0.00"},{"v":0,"d":"0.00"},{"v":0,"d":"0.00"},{"v":0,"d":"0.00"},{"v":0,"d":"0.00"},{"v":0,"d":"0.00"},{"v":0,"d":"0.00"},{"v":0,"d":"0.00"},null,{"$f":"SUM(CK6:CK1150)","v":0},{"$nulls":4},{"$f":"SUM(CP6:CP1150)","v":{"v":0,"d":"0.00"}},{"$f":"SUM(CQ6:CQ1150)","v":{"v":0,"d":"0.00"}},{"$f":"SUM(CR6:CR1150)","v":{"v":0,"d":"0.00"}}]
[null,"Substrats","Catégorie du substrat (catégorie 1)","Catégorie du substrat (catégorie 2)","Nom du substrat","Catégorie pour score azote","Quantité (tonnes)","km parcourus","t.km","% de camions roulant au biométhane utilisés pour la collecte","% MS/MB","% MO/MS","Potentiel méthanogène (Nm3 CH4 / t MO)","%vol CH4","Azote total \n(kg/t MB)","Azote NH4+\n(kg/t MB)","P2O5 (kg / tMB)","K2O (kg / tMB)","kgC/tMB","Broyage : pourcentage du substrat broyé avant incorporation dans le digesteur (% de la masse du substrat)","Hygiénisation : pourcentage du substrat hygiénisé avant incorporation dans le digesteur (% de la masse du substrat)","MS (t)","Flux de matière sèche dans le digestat (t MS/an)","MO (t)","Flux de matière organique dans le digestat (t MO/an)","Potentiel méthanogène (Nm3 CH4 / t MB)","CH4 potentiel (Nm3)","CH4 exprimé (Nm3)","CH4 potentiel (kg)","CH4 exprimé (kg)","Potentiel méthanogène (Nm3 CH4 / t MS)","%vol CO2","Potentiel de production de CO2 (Nm3 CO2 / t MB)","CO2 potentiel (Nm3)","CO2 exprimé (Nm3)","CO2 potentiel (kg)","CO2 exprimé (kg)","Biogaz potentiel (Nm3)","Biogaz exprimé (Nm3)","Biogaz potentiel (kg)","Biogaz exprimé (kg)","C biogaz potentiel (kg C)","C biogaz exprimé (kg C)","N total (kg)","NH4+ (kg)","Flux de NH4+ dans le digestat (t NH4+/an)","P2O5 total (kg)","K2O total (kg)","C total (kg)","Taux de minéralisation (%)","Pourcentage de carbone biodégradable (%C_biodeg/C_tot)","Flux de carbone organique dans le digestat (t C/an)","Flux de MB dans le digestat (t)","Vérif MB dans le digestat (sys-métha)","Masse sèche récoltée (avant ensilage)","Rendement de culture (tMS / ha)","hectares","Consommation de diesel évité par les CIVE pour le remplacement de CIPAN (kg / an)","(1) Consommation de diesel à l'hectare (kg / ha / an)","(1) Consommation de bioGNV à l'hectare (kg / ha / an)","(2) Consommation de diesel à l'hectare (kg / ha / an)","(2) Consommation de bioGNV à l'hectare (kg / ha / an)","(3) Consommation de diesel à l'hectare (kg / ha / an)","(3) Consommation de bioGNV à l'hectare (kg / ha / an)","Consommation de diesel à l'hectare (kg / ha / an)","Consommation de bioGNV à l'hectare (kg / ha / an)","Consommation de diesel à l'ensilage (kg / an)","Consommation de bioGNV à l'ensilage (kg / an)","Consommation de diesel globale (kg / an)","Consommation de bioGNV globale (kg / an)","Emissions à 20 ans (kg CO2 eq / an)","Emissions  à 100 ans (kg CO2 eq / an)","Stockage C à 20 ans (tC / ha / an)","Stockage C à 20 ans (tC / an)","Stockage eq CO2 à 20 ans (t eq CO2 / an)","Stockage C à 100 ans (tC / ha / an) ","Stockage C à 100 ans (tC /an) ","Stockage eq CO2 à 100 ans (t eq CO2 / an)","Utilisation de fertilisant azoté évitée par les légumineuses cultivée avec des CIVE (kg / an)","Fertilisation N minéral (kg UN)","Fertilisation azote organique - lisier et fumier (kg UN)","Fertilisation azote organique - digestat (kg UN)","Fertilisation K (kg K2O)","Fertilisation P (kg P2O5)","Phytosanitaires (kg)","Pré-stockage effluents d'élevage - avec méthanisation (kg eq CO2 20 ans)","Pré-stockage effluents d'élevage - avec méthanisation (kg eq CO2 100 ans)","km filière de réf","t.km de référence","Filière de traitement de référence","kg CO2 à 20 ans / kg de déchets traités","kg CO2 à 100 ans / kg de déchets traités","kWh fossile et nucléaire / kg de déchets traités","kg CO2 à 20 ans / an","kg CO2 à 100 ans / an","kWh fossile et nucléaire / an","Emission au stockage des effluents (kg eq CO2 20 ans / tMB)","Emission au stockage des effluents (kg eq CO2 100 ans / tMB)","Emission à l'épandage des effluents (kg eq CO2 20 ans / tMB)","Emission à l'épandage des effluents (kg eq CO2 100 ans / tMB)","substitution à l'épandage des effluents (kg eq CO2 20 ans / tMB)","substitution à l'épandage des effluents (kg eq CO2 100 ans / tMB)","substitution à l'épandage des effluents (kWh eq / tMB)"]

{"sheet":"Données projet","index":11,"n_rows":125,"n_cols":5,"rows_kept":125,"hidden":true}
["Données du projet obtenues via le formulaire de saisie (se remplit automatiquement, invisible pour l'utilisateur) :"]
[]
[]
["2. Paramètres de l'installation"]
[null,"Données du calculateur","Données utilisateur","Données par défaut","Sources"]
["Nom de l'installation",{"$f":"IF(D6=\"/\",C6,IF(C6=0,D6,C6))","v":0},{"$f":"'Description des substrats'!E2","v":0},"/"]
["Année du diagnostic",0,{"$f":"'Description des substrats'!E3","v":0},"/"]
["Type d'installation","Votre choix",{"$f":"'Description des substrats'!E4","v":"Votre choix"},"/"]
["Type de valorisation énergétique",{"$f":"IF(D9=\"/\",C9,IF(C9=0,D9,C9))","v":"Votre choix"},{"$f":"'Description des substrats'!E5","v":"Votre choix"},"/"]
["Capacité annuelle de l'unité (Nm3.h)",{"$f":"'Description des substrats'!E7","v":0},{"$f":"'Description des substrats'!E7","v":0},"/"]
["Puissance de l'unité (kW)",{"$f":"'Description des substrats'!E8","v":0},{"$f":"'Description des substrats'!E8","v":0},"/"]
["Puissance électrique de la cogénératrice (kW)",{"$f":"'Description des substrats'!E9","v":0},{"$f":"'Description des substrats'!E9","v":0},"/"]
["Puissance thermique de la cogénératrice (kW)",{"$f":"'Description des substrats'!E10","v":0},{"$f":"'Description des substrats'!E10","v":0},"/"]
["Heures de fonctionnement par an",{"$f":"'Description des substrats'!C11","v":"Heures de fonctionnement par an"},{"$f":"'Description des substrats'!C11","v":"Heures de fonctionnement par an"},"/"]
["Type de déconditionneur","Votre choix",{"$f":"soupes","v":"Votre choix"},"/"]
["Distance pré-déconditionnement (km)",0,{"$f":"IF(C15=\"Déconditionneur sur place\",distplace,IF(C15=\"Déconditionneur centralisé\",distcentralise,0))","v":0},"/"]
["Distance post-déconditionnement (km)",0,{"$f":"IF(C15=\"Déconditionneur centralisé\",distmetha,0)","v":0},"/"]
["Distance total des soupes",{"$f":"B16+B17","v":0},"/","/"]
["Capacité (m3)",0,{"$f":"'Caractéristique de installation'!D4","v":0},"/"]
["Post-digesteur","Votre choix",{"$f":"'Caractéristique de installation'!D5","v":"Votre choix"},"/"]
["Capacité post-digesteur (m3)",0,{"$f":"IF(C20=\"oui\",'Caractéristique de installation'!E6,0)","v":0},"/"]
["Volume substrats annuel (m3)",0,null,{"$f":"'Données projet substrat'!G4","v":0},"Calcul d'un volume hypothétique avec l'hypothèse que les substrats ont tous la masse volumique de l'eau"]
["Estimation du TSH",{"$error":"#DIV/0!"},null,{"$f":"(B19+B21)/(B22/365)","v":{"$error":"#DIV/0!"}},"donnée calculée (capacité digesteur et post-digesteur/volume substrats)"]
["% du BMP atteint considéré",{"$error":"#DIV/0!"},null,{"$f":"IF(B23<80,IF(OR(C90=\"couvert avec récupération\",C91=\"couvert avec récupération\"),0.95,0.9),IF(B23>80,IF(OR(C90=\"couvert avec récupération\",C91=\"couvert avec récupération\"),1,0.95)))","v":{"$error":"#DIV/0!"}},"donnée calculée (BDD ICV)"]
["Traitement des airs viciés",{"$f":"IF(D25=\"/\",C25,IF(C25=\"\",D25,C25))","v":"Votre choix"},{"$f":"'Caractéristique de installation'!D7","v":"Votre choix"},"/"]
["% biogaz envoyé en torchère",{"$f":"IF(D26=\"/\",C26,IF(C26=0,D26,C26))","v":{"v":0.015,"d":"1.5%"}},{"$f":"'Caractéristique de installation'!D17","v":{"v":0,"d":"0.0%"}},{"$f":"'BDD modélisation ICV'!B71","v":{"v":0.015,"d":"1.5%"}},"AREC IDF, 2022"]
["Usage mix électrique français",{"$f":"IF(D27=\"/\",C27,IF(C27=\"\",D27,C27))","v":"Votre choix"},{"$f":"'Caractéristique de installation'!D26","v":"Votre choix"},"Oui"]
["MWh mix électrique FR",{"$f":"C28","v":0},{"$f":"IF(C27=\"oui\",'Caractéristique de installation'!E26+'Caractéristique de installation'!E28,'Caractéristique de installation'!E28)","v":0},"/"]
["% mix électrique français",{"$f":"IF(D29=\"/\",C29,IF(C29=0,D29,C29))","v":{"v":1,"d":"100%"}},{"$f":"IF(C28=0,0,C28/C36)","v":{"v":0,"d":"0%"}},{"$f":"IF(B36=0,100%,0%)","v":{"v":1,"d":"100%"}}]
["Usage autoconsommation e.",{"$f":"IF(D30=\"/\",C30,IF(C30=0,D30,C30))","v":"Votre choix"},{"$f":"'Caractéristique de installation'!D25","v":"Votre choix"},"Non"]
["MWh autoconsommation e.",{"$f":"IF(D31=\"/\",C31,IF(C31=\"\",D31,C31))","v":0},{"$f":"IF(C30=\"oui\",'Caractéristique de installation'!E25,0)","v":0},"/"]
["% autoconsommation e.",{"$f":"IF(D32=\"/\",C32,IF(C32=\"\",D32,C32))","v":{"v":0,"d":"0%"}},{"$f":"IF(C31=0,0,C31/C36)","v":{"v":0,"d":"0%"}},{"v":0,"d":"0%"}]
["Usage photovoltaïque",{"$f":"IF(D33=\"/\",C33,IF(C33=0,D33,C33))","v":"Votre choix"},{"$f":"'Caractéristique de installation'!D27","v":"Votre choix"},"Non"]
["MWh photovoltaïque",0,{"$f":"IF(C33=\"oui\",'Caractéristique de installation'!E27,0)","v":0},"/"]
["% photovoltaïque",{"$f":"IF(D35=\"/\",C35,IF(C35=\"\",D35,C35))","v":{"v":0,"d":"0%"}},{"$f":"IF(C34=0,0,C34/C36)","v":{"v":0,"d":"0%"}},{"v":0,"d":"0%"}]
["Consommation électricité (MWh)",0,{"$f":"C28+C31+C34","v":0},"/"]
["Comprend broyage","Votre choix",{"$f":"'Caractéristique de installation'!E29","v":"Votre choix"},"/"]
["Comprend post-traitement (séparation des phases du digestat)","Votre choix",{"$f":"'Caractéristique de installation'!E30","v":"Votre choix"},"/"]
["Usage Gaz Naturel","Votre choix",{"$f":"'Caractéristique de installation'!D35","v":"Votre choix"},"Oui"]
["MWh Gaz Naturel",0,{"$f":"IF(C39=\"oui\",'Caractéristique de installation'!E35+'Caractéristique de installation'!E36,'Caractéristique de installation'!E36)","v":0},"/"]
["% Gaz Naturel",{"$f":"IF(D41=\"/\",C41,IF(C41=0,D41,C41))","v":{"v":0,"d":"0%"}},{"$f":"IF(C40=0,0,C40/C51)","v":{"v":0,"d":"0%"}},{"v":0,"d":"0%"}]
["Usage autoconsommation th.","Votre choix",{"$f":"'Caractéristique de installation'!D33","v":"Votre choix"},"Non"]
["MWh autoconsommation th.",0,{"$f":"IF(C42=\"oui\",'Caractéristique de installation'!E33,0)","v":0},"/"]
["% autoconsommation th.",{"$f":"IF(D44=\"/\",C44,IF(C44=\"\",D44,C44))","v":{"v":0,"d":"0%"}},{"$f":"IF(C43=0,0,C43/C51)","v":{"v":0,"d":"0%"}},{"$f":"IF(B51=0,100%,0%)","v":{"v":1,"d":"100%"}},"100% par défaut"]
["Usage Géothermie (ou utilisation de chaleur fatale?)","Votre choix",{"$f":"'Caractéristique de installation'!D34","v":"Votre choix"},"Non"]
["MWh Géothermie",0,{"$f":"IF(C45=\"oui\",'Caractéristique de installation'!E34,0)","v":0},"/"]
["% Géothermie",{"$f":"IF(D47=\"/\",C47,IF(C47=\"\",D47,C47))","v":{"v":0,"d":"0%"}},{"$f":"IF(C46=0,0,C46/C51)","v":{"v":0,"d":"0.0%"}},{"v":0,"d":"0%"}]
["Usage source inconnue/chaleur fatale",{"$f":"IF(D48=\"/\",C48,IF(C48=0,D48,C48))","v":"Votre choix"},{"$f":"'Caractéristique de installation'!D36","v":"Votre choix"},"Non"]
["MWh Source inconnue/chaleur fatale",{"$f":"IF(D49=\"/\",C49,IF(C49=0,D49,C49))","v":0},{"$f":"'Caractéristique de installation'!E36","v":0},"/"]
["% source inconnue/chaleur fatale",{"$f":"IF(D50=\"/\",C50,IF(C50=\"\",D50,C50))","v":{"v":0,"d":"0%"}},{"$f":"IF(C49=0,0,C49/C51)","v":{"v":0,"d":"0.0%"}},{"v":0,"d":"0%"}]
["Consommation thermique (MWh)",{"$f":"IF(D51=\"/\",C51,IF(C51=0,D51,C51))","v":0},{"$f":"C40+C43+C46+C49","v":0},"/"]
["Comprend hygiènisation","Votre choix",{"$f":"'Caractéristique de installation'!D37","v":"Votre choix"},"non"]
["Rendement électrique",{"v":0,"d":"0.0%"},{"$f":"'Valorisation du biogaz'!E22","v":{"v":0,"d":"0.0%"}},{"$f":"IF(B9=\"cogénération\",'BDD modélisation ICV'!B65,0)","v":{"v":0,"d":"0.0%"}},"PROdige"]
["Rendement thermique",{"v":0,"d":"0%"},{"$f":"'Valorisation du biogaz'!E25","v":{"v":0,"d":"0.0%"}},{"$f":"IF(OR(B9=\"cogénération\",B9=\"chaleur seule\"),'BDD modélisation ICV'!B66,0)","v":{"v":0,"d":"0.0%"}},"Bilan IDF 2020 / AREC IDF, 2022"]
["Chaleur valorisée",{"v":0,"d":"0%"},{"$f":"'Valorisation du biogaz'!E26","v":{"v":0,"d":"0.00%"}},{"$f":"IF(OR(B9=\"cogénération\",B9=\"chaleur seule\"),'BDD modélisation ICV'!B67,0)","v":{"v":0,"d":"0%"}},"PROdige"]
["Présence épurateur (réseau ou bioGNV en plus de cogé)","non",{"$f":"IF(B9=\"cogénération\",'Valorisation du biogaz'!D4,\"non\")","v":"non"},"/"]
["% biogaz détourné en épuration",{"v":0,"d":"0%"},{"$f":"IF(C56=\"oui\",'Valorisation du biogaz'!E5,0)","v":{"v":0,"d":"0.00%"}},"/"]
["Rendement épurateur",{"v":0.97,"d":"97.0%"},{"$f":"'Valorisation du biogaz'!D8","v":{"v":0,"d":"0.0%"}},{"$f":"IF(B61=\"membranaire\",'BDD modélisation ICV'!B48,'BDD modélisation ICV'!B49)","v":{"v":0.97,"d":"97.0%"}}]
["Présence cogénérateur (en plus de épuration/injection)","non",{"$f":"IF(B9=\"Epuration/injection\",'Valorisation du biogaz'!D10,\"non\")","v":"non"},"/"]
["% biogaz détourné vers cogé",{"$f":"IF(D60=\"/\",C60,IF(C60=0,D60,C60))","v":{"v":0,"d":"0%"}},{"$f":"IF(C59=\"oui\",'Valorisation du biogaz'!E11,0)","v":{"v":0,"d":"0%"}},{"$f":"IF(C59=\"oui\",'BDD modélisation ICV'!B34,0)","v":{"v":0,"d":"0%"}},"DREAL Bretagne 2022"]
["Type d'épurateur","Votre choix",{"$f":"'Valorisation du biogaz'!D7","v":"Votre choix"},"/"]
["Présence oxydateur thermique","Votre choix",{"$f":"'Valorisation du biogaz'!D12","v":"Votre choix"},"/"]
["Captage CO2","Votre choix",{"$f":"'Valorisation du biogaz'!D13","v":"Votre choix"},"/","GRDF/Solagro?"]
["% CO2 capté (t)",{"v":0,"d":"0%"},{"$f":"IF(C63=\"oui\",'Valorisation du biogaz'!E14,0)","v":{"v":0,"d":"0%"}},{"$f":"IF(C63=\"Oui\",'BDD modélisation ICV'!B54,0)","v":{"v":0,"d":"0%"}},"GRDF"]
["Production électrique brute annuelle (MWh)",{"$f":"IF(D65=\"/\",C65,IF(C65=0,D65,C65))","v":0},{"$f":"IF('Description des substrats'!E5=\"Cogénération\",'Valorisation du biogaz'!D21,0)","v":0},"/"]
["Production thermique brute annuelle (MWh)",{"$f":"IF(D66=\"/\",C66,IF(C66=0,D66,C66))","v":0},{"$f":"IF('Description des substrats'!E5=\"Epuration/injection\",0,'Valorisation du biogaz'!D24)","v":0},"/"]
["Production biométhane brut annuelle (MWh)",0,{"$f":"IF('Description des substrats'!E5=\"Epuration/injection\",'Valorisation du biogaz'!D28,0)","v":0},"/"]
["Présence station BioGNV","Votre choix",{"$f":"'Valorisation du biogaz'!D15","v":"Votre choix"},"/","REDII?"]
["% de la production valorisée en  BioGNV",{"v":0,"d":"0%"},{"$f":"IF(B68=\"oui\",'Valorisation du biogaz'!E16,0)","v":{"v":0,"d":"0%"}},"/","REDII?"]
["% énergie électrique autoconsommé",{"$f":"IF(D70=\"/\",C70,IF(C70=0,D70,C70))","v":{"v":0,"d":"0%"}},{"$f":"IFERROR(B31/('Calculs fonctionnement'!B230*'Calculs fonctionnement'!B220+'Calculs fonctionnement'!C230*'Calculs fonctionnement'!C220),0)","v":{"v":0,"d":"0%"}},{"$f":"IF(OR(B9=\"cogénération\",B59=\"oui\"),IF(B36=0,'BDD modélisation ICV'!C58,0),0)","v":{"v":0,"d":"0%"}},"14% from ADEME grand Est 2021"]
["% énergie électrique vendue",{"v":1,"d":"100%"},{"$f":"1-B70","v":{"v":1,"d":"100%"}},"/"]
["% énergie thermique valorisée autoconsommé",{"v":0,"d":"0%"},{"$f":"IFERROR(B43/('Calculs fonctionnement'!B231*'Calculs fonctionnement'!B221+'Calculs fonctionnement'!C231*'Calculs fonctionnement'!C221),0)","v":{"v":0,"d":"0%"}},{"$f":"IF(B51=0,IF(B9=\"cogénération\",'BDD modélisation ICV'!F60,IF(B59=\"oui\",('BDD modélisation ICV'!B34*'Calculs fonctionnement'!E124)/('Calculs fonctionnement'!C231*1000),0)),0)","v":{"v":0,"d":"0%"}},"22% ADEME grand Est 2021"]
["% énergie thermique vendue",{"v":0,"d":"0%"},{"$f":"B55*(1-B72)","v":{"v":0,"d":"0%"}},"/"]
[]
["Emissions fugitives"]
["Présence d'une torchère automatique ?",{"$f":"'Caractéristique de installation'!D9","v":"Votre choix"},{"$f":"IF(B76=\"Non\",'BDD modélisation ICV'!C164,'BDD modélisation ICV'!D164)","v":{"v":0.05,"d":"5.0%"}}]
["Passage annuel d'une caméra IR ?",{"$f":"'Caractéristique de installation'!D10","v":"Votre choix"},{"$f":"IF($B$76=\"Non\",IF(B77=\"Oui\",'BDD modélisation ICV'!C165,0),IF(B77=\"Oui\",'BDD modélisation ICV'!D165,0))","v":{"v":0,"d":"0.0%"}}]
["Passage hebdomadaire d'un renifleur de méthane ?",{"$f":"'Caractéristique de installation'!D11","v":"Votre choix"},{"$f":"IF($B$76=\"Non\",IF(B78=\"Oui\",'BDD modélisation ICV'!C166,0),IF(B78=\"Oui\",'BDD modélisation ICV'!D166,0))","v":{"v":0,"d":"0.0%"}}]
["Utilisation d'un outil de pilotage pour la bonne gestion de l'alimentation du digesteur ?",{"$f":"'Caractéristique de installation'!D12","v":"Votre choix"},{"$f":"IF($B$76=\"Non\",IF(B79=\"Oui\",'BDD modélisation ICV'!C167,0),IF(B79=\"Oui\",'BDD modélisation ICV'!D167,0))","v":{"v":0,"d":"0.0%"}}]
["Maintenance et suivi quotidien des soupapes ?",{"$f":"'Caractéristique de installation'!D13","v":"Votre choix"},{"$f":"IF($B$76=\"Non\",IF(B80=\"Oui\",'BDD modélisation ICV'!C168,0),IF(B80=\"Oui\",'BDD modélisation ICV'!D168,0))","v":{"v":0,"d":"0.0%"}}]
["Ronde journalière sur les éléments clés ?",{"$f":"'Caractéristique de installation'!D14","v":"Votre choix"},{"$f":"IF($B$76=\"Non\",IF(B81=\"Oui\",'BDD modélisation ICV'!C169,0),IF(B81=\"Oui\",'BDD modélisation ICV'!D169,0))","v":{"v":0,"d":"0.0%"}}]
["Graissage annuel des passages de câbles ?",{"$f":"'Caractéristique de installation'!D15","v":"Votre choix"},{"$f":"IF($B$76=\"Non\",IF(OR(B82=\"Oui\",B82=\"non concerné\"),'BDD modélisation ICV'!C170,0),IF(OR(B82=\"Oui\",B82=\"non concerné\"),'BDD modélisation ICV'!D170,0))","v":{"v":0,"d":"0.0%"}}]
[null,"TOTAL abattement",{"$f":"SUM(C76:C82)","v":{"v":0.05,"d":"5.0%"}}]
[]
["3. Paramètres du digestat"]
[null,"Données du calculateur","Données utilisateur","Données par défaut","Sources"]
["Post-traitement digestat",{"$f":"IF(D87=\"/\",C87,IF(C87=0,D87,C87))","v":"Votre choix"},{"$f":"'Valorisation du digestat'!D5","v":"Votre choix"},"/"]
["% séparation",{"$f":"IF(B87=\"pas de post-traitement\",0,IF(D88=\"/\",C88,IF(C88=0,D88,C88)))","v":{"v":0,"d":"0%"}},{"$f":"'Valorisation du digestat'!E6","v":{"v":0,"d":"0.00%"}},"/"]
["% digestat liquide recirculé",{"$f":"IF(B87=\"pas de post-traitement\",0,IF(D89=\"/\",C89,IF(C89=0,D89,C89)))","v":{"v":0,"d":"0%"}},{"$f":"'Valorisation du digestat'!E7","v":{"v":0,"d":"0.00%"}},"/"]
["Stockage digestat liquide",{"$f":"IF(D90=\"/\",C90,IF(C90=0,D90,C90))","v":"Votre choix"},{"$f":"'Valorisation du digestat'!E8","v":"Votre choix"},"/"]
["Stockage digestat brut","Votre choix",{"$f":"'Valorisation du digestat'!D9","v":"Votre choix"},"/"]
["Transport digestat (km)","",{"$f":"'Valorisation du digestat'!D10","v":0},{"$f":"IF(B8=\"à la ferme\",'BDD modélisation ICV'!F17,IF(B8=\"centralisée/territoriale\",'BDD modélisation ICV'!F18,IF(B8=\"industrielle\",'BDD modélisation ICV'!F19,IF(B8=\"STEP\",'BDD modélisation ICV'!F20,\"\"))))","v":""},"ADEME grand Est 2021"]
["Matériel d'épandage (brut)","Votre choix",{"$f":"'Valorisation du digestat'!D12","v":"Votre choix"},"/"]
["Matériel d'épandage (liquide)","Votre choix",{"$f":"'Valorisation du digestat'!E13","v":"Votre choix"},"/"]
["Matériel d'épandage (solide)",{"$f":"IF(D95=\"/\",C95,IF(C95=0,D95,C95))","v":"Sans incorporation"},{"$f":"'Valorisation du digestat'!E14","v":"Sans incorporation"},"/"]
[]
["4. Economie circulaire et biodiversité"]
[]
["1. Gestion des cultures - méthanisation agricole"]
["% de la SAU occuppé par les cultures principales ?",{"$f":"'Economie circulaireBiodiversité'!D9","v":{"v":0,"d":"0.00%"}}]
["% de la SAU occupé par les CIVE d'été ?",{"$f":"'Economie circulaireBiodiversité'!D10","v":{"v":0,"d":"0.00%"}}]
["% de la SAU occupé par les CIVE d'hiver ?",{"$f":"'Economie circulaireBiodiversité'!D11","v":{"v":0,"d":"0.00%"}}]
["% de la SAU occupé par les prairies ?",{"$f":"'Economie circulaireBiodiversité'!D12","v":{"v":0,"d":"0.00%"}}]
["2. Gestion des CIVE"]
["Irrigation des CIVE ?",{"$f":"'Economie circulaireBiodiversité'!D16","v":"Votre choix"}]
["Usage de perticides sur les CIVE ?",{"$f":"'Economie circulaireBiodiversité'!D17","v":"Votre choix"}]
["Fertilisation minérale des CIVE ?",{"$f":"'Economie circulaireBiodiversité'!D18","v":"Votre choix"}]
["Pratique de techniques culturales simplifiées sur les CIVE ?",{"$f":"'Economie circulaireBiodiversité'!D19","v":"Votre choix"}]
["Au moins une des CIVE est-elle cultivée avec au moins deux espèces végétales différentes ?",{"$f":"'Economie circulaireBiodiversité'!D20","v":"Votre choix"}]
["3. Exploitation"]
["% de substitution des engrais minéraux sur l'exploitation ?",{"$f":"'Economie circulaireBiodiversité'!D24","v":0}]
["L'exploitation a-t-elle obtenu une certification HVE niveau 3 ?",{"$f":"'Economie circulaireBiodiversité'!D25","v":"Votre choix"}]
["L'exploitation a-t-elle obtenu une certification Agriculture Biologique ?",{"$f":"'Economie circulaireBiodiversité'!D26","v":"Votre choix"}]
["L'exploitation a-t-elle réalisé des bilans humiques et/ou des analyses de la qualité des sols ?",{"$f":"'Economie circulaireBiodiversité'!D27","v":"Votre choix"}]
["4. Economie circulaire et Intégration dans le territoire"]
["L'exploitation est-elle gouvernée localement ?",{"$f":"'Economie circulaireBiodiversité'!D30","v":"Votre choix"}]
["A quelle hauteur l'exploitation est-elle financée par des acteurs locaux (collectivités, citoyens, entreprises…) ?",{"$f":"'Economie circulaireBiodiversité'!D31","v":"Votre choix"}]
["A quelle hauteur la collectivité locale est-elle impliquée dans l'exploitation (approvisionnement en biodéchets, achat d'énergie, concertation…) ?",{"$f":"'Economie circulaireBiodiversité'!D32","v":"Votre choix"}]
["A quelle hauteur le digestat est-il épandu sur les terres des actionnaires agricoles ? (Faible= moins de 20% du digestat, moyenne = entre 20 et 50%, forte = plus de 50% du digestat)",{"$f":"'Economie circulaireBiodiversité'!D33","v":"Votre choix"}]
["5. Biodiversité sur le site de méthanisation"]
["Surface du site de méthanisation ?",{"$f":"'Economie circulaireBiodiversité'!D36","v":0}]
["Le site de méthanisation est-il installé sur une surface déjà artificialisée ?",{"$f":"'Economie circulaireBiodiversité'!D37","v":"Votre choix"}]
["% de surface au sol imperméabilisée par l'installation ?",{"$f":"'Economie circulaireBiodiversité'!D38","v":0.8}]
["A quelle hauteur l'intégration paysagère a-t-elle été prise en compte lors de la conception du projet ?",{"$f":"'Economie circulaireBiodiversité'!D39","v":"Votre choix"}]
["Combien de mètres de linéaires de haies ont été plantés sur l'installation ?",{"$f":"'Economie circulaireBiodiversité'!D40","v":0}]

{"sheet":"Calcul AMG","index":12,"n_rows":186,"n_cols":107,"rows_kept":186,"hidden":true}
{"$rows_empty":33}
[null,null,"Ccrop_AG",null,null,9,10,11,12,13,14,15,16,17,18,19,20,21,22,23,24,25,26,27,28,29,30,31,32,33,34,35,36,37,38,39,40,41,42,43,44,45,46,47,48,49,50,51,52,53,54,55,56,57,58,59,60,61,62,63,64,65,66,67,68,69,70,71,72,73,74,75,76,77,78,79,80,81,82,83,84,85,86,87,88,89,90,91,92,93,94,95,96,97,98,99,100,101,102,103,104,105,106,107,108,109,110]
[{"$nulls":4},"Année",1,2,3,4,5,6,7,8,9,10,11,12,13,14,15,16,17,18,19,20,21,22,23,24,25,26,27,28,29,30,31,32,33,34,35,36,37,38,39,40,41,42,43,44,45,46,47,48,49,50,51,52,53,54,55,56,57,58,59,60,61,62,63,64,65,66,67,68,69,70,71,72,73,74,75,76,77,78,79,80,81,82,83,84,85,86,87,88,89,90,91,92,93,94,95,96,97,98,99,100,101,102]
[{"$nulls":5},{"$f":"IF(F51=1,$T$160,\"\")","v":""},{"$f":"IF(G51=1,$T$160,\"\")","v":""},"","","","","","","","","","","","","","","","","","","","","","","","","","","","","","",{"$f":"IF(AL51=1,$T$160,\"\")","v":""},"","","","","","","","","","","","","","","","","","","","","","","","","","","","","","","",{"$f":"IF(BR51=1,$T$160,\"\")","v":""},"","","","","","","","","","","","","","","","","","","","","","","","","","","","","","","","","","","",{"$f":"IF(DB51=1,$T$160,\"\")","v":""},""]
[{"$nulls":3},"Paramètre","Y théorique",{"$f":"F51*$U$160","v":0},0,0,0,0,0,0,0,0,0,0,0,0,0,0,0,0,0,0,0,0,0,0,0,0,0,0,0,0,0,0,0,{"$f":"AL51*$U$160","v":0},0,0,0,0,0,0,0,0,0,0,0,0,0,0,0,0,0,0,0,0,0,0,0,0,0,0,0,0,0,0,0,{"$f":"BR51*$U$160","v":0},0,0,0,0,0,0,0,0,0,0,0,0,0,0,0,0,0,0,0,0,0,0,0,0,0,0,0,0,0,0,0,0,0,0,0,{"$f":"DB51*$U$160","v":0},0]
[{"$nulls":4},"Y sans métha",{"$f":"F37*(1-F57)*F51","v":0},0,0,0,0,0,0,0,0,0,0,0,0,0,0,0,0,0,0,0,0,0,0,0,0,0,0,0,0,0,0,0,{"$f":"AL37*(1-AL57)*AL51","v":0},0,0,0,0,0,0,0,0,0,0,0,0,0,0,0,0,0,0,0,0,0,0,0,0,0,0,0,0,0,0,0,{"$f":"BR37*(1-BR57)*BR51","v":0},0,0,0,0,0,0,0,0,0,0,0,0,0,0,0,0,0,0,0,0,0,0,0,0,0,0,0,0,0,0,0,{"$f":"CX37*(1-CX57)*CX51","v":0},{"$f":"CY37*(1-CY57)*CY51","v":0},{"$f":"CZ37*(1-CZ57)*CZ51","v":0},{"$f":"DA37*(1-DA57)*DA51","v":0},{"$f":"DB37*(1-DB57)*DB51","v":0},0]
[{"$nulls":4},"Y avec métha",{"$f":"F37*(1-F67)*F51","v":0},0,0,0,0,0,0,0,0,0,0,0,0,0,0,0,0,0,0,0,0,0,0,0,0,0,0,0,0,0,0,0,{"$f":"AL37*(1-AL67)*AL51","v":0},0,0,0,0,0,0,0,0,0,0,0,0,0,0,0,0,0,0,0,0,0,0,0,0,0,0,0,0,0,0,0,{"$f":"BR37*(1-BR67)*BR51","v":0},0,0,0,0,0,0,0,0,0,0,0,0,0,0,0,0,0,0,0,0,0,0,0,0,0,0,0,0,0,0,0,0,0,0,0,{"$f":"DB37*(1-DB67)*DB51","v":0},0]
[{"$nulls":3},"Paramètre","HI",{"$f":"IFERROR(VLOOKUP(F36,$R$168:$X$178,3,FALSE),0)","v":0},0,0,0,0,0,0,0,0,0,0,0,0,0,0,0,0,0,0,0,0,0,0,0,0,0,0,0,0,0,0,0,{"$f":"IFERROR(VLOOKUP(AL36,$R$168:$X$178,3,FALSE),0)","v":0},0,0,0,0,0,0,0,0,0,0,0,0,0,0,0,0,0,0,0,0,0,0,0,0,0,0,0,0,0,0,0,{"$f":"IFERROR(VLOOKUP(BR36,$R$168:$X$178,3,FALSE),0)","v":0},0,0,0,0,0,0,0,0,0,0,0,0,0,0,0,0,0,0,0,0,0,0,0,0,0,0,0,0,0,0,0,0,0,0,0,{"$f":"IFERROR(VLOOKUP(DB36,$R$168:$X$178,3,FALSE),0)","v":0},0]
[{"$nulls":3},"Calcul","Ccrop_AG sans métha",{"$f":"IFERROR(F38*(1-F40)/F40*0.44,0)","v":0},0,0,0,0,0,0,0,0,0,0,0,0,0,0,0,0,0,0,0,0,0,0,0,0,0,0,0,0,0,0,0,{"$f":"IFERROR(AL38*(1-AL40)/AL40*0.44,0)","v":0},0,0,0,0,0,0,0,0,0,0,0,0,0,0,0,0,0,0,0,0,0,0,0,0,0,0,0,0,0,0,0,{"$f":"IFERROR(BR38*(1-BR40)/BR40*0.44,0)","v":0},0,0,0,0,0,0,0,0,0,0,0,0,0,0,0,0,0,0,0,0,0,0,0,0,0,0,0,0,0,0,0,{"$f":"IFERROR(CX38*(1-CX40)/CX40*0.44,0)","v":0},{"$f":"IFERROR(CY38*(1-CY40)/CY40*0.44,0)","v":0},{"$f":"IFERROR(CZ38*(1-CZ40)/CZ40*0.44,0)","v":0},{"$f":"IFERROR(DA38*(1-DA40)/DA40*0.44,0)","v":0},{"$f":"IFERROR(DB38*(1-DB40)/DB40*0.44,0)","v":0},0]
[{"$nulls":4},"Ccrop_AG avec métha",{"$f":"IFERROR(F39*(1-F40)/F40*0.44,0)","v":0},0,0,0,0,0,0,0,0,0,0,0,0,0,0,0,0,0,0,0,0,0,0,0,0,0,0,0,0,0,0,0,{"$f":"IFERROR(AL39*(1-AL40)/AL40*0.44,0)","v":0},0,0,0,0,0,0,0,0,0,0,0,0,0,0,0,0,0,0,0,0,0,0,0,0,0,0,0,0,0,0,0,{"$f":"IFERROR(BR39*(1-BR40)/BR40*0.44,0)","v":0},0,0,0,0,0,0,0,0,0,0,0,0,0,0,0,0,0,0,0,0,0,0,0,0,0,0,0,0,0,0,0,0,0,0,0,{"$f":"IFERROR(DB39*(1-DB40)/DB40*0.44,0)","v":0},0]
[]
[]
[null,null,"Culture de couverture_AG"]
[{"$nulls":4},"Place de la culture suivant la CC"]
[{"$nulls":4},"Place de la culture suivant la CC",{"$f":"V160","v":0}]
[{"$nulls":4},"Nombre de culture",{"$f":"W160","v":0}]
[{"$nulls":5},1,{"$f":"IF(F49=$F$48,1,F49+1)","v":2},3,4,5,6,7,8,9,10,11,12,13,14,15,16,17,18,19,20,21,22,23,24,25,26,27,28,29,30,31,32,33,{"$f":"IF(AL49=$F$48,1,AL49+1)","v":34},35,36,37,38,39,40,41,42,43,44,45,46,47,48,49,50,51,52,53,54,55,56,57,58,59,60,61,62,63,64,65,{"$f":"IF(BR49=$F$48,1,BR49+1)","v":66},67,68,69,70,71,72,73,74,75,76,77,78,79,80,81,82,83,84,85,86,87,88,89,90,91,92,93,94,95,96,97,98,99,100,{"$f":"IF(DA49=$F$48,1,DA49+1)","v":101},{"$f":"IF(DB49=$F$48,1,DB49+1)","v":102}]
[]
[{"$nulls":4},"Année d'introduction des résidus de la CC et de la culture impactée",{"$f":"IF(F49=$F$47,1,0)","v":0},0,0,0,0,0,0,0,0,0,0,0,0,0,0,0,0,0,0,0,0,0,0,0,0,0,0,0,0,0,0,0,{"$f":"IF(AL49=$F$47,1,0)","v":0},0,0,0,0,0,0,0,0,0,0,0,0,0,0,0,0,0,0,0,0,0,0,0,0,0,0,0,0,0,0,0,{"$f":"IF(BR49=$F$47,1,0)","v":0},0,0,0,0,0,0,0,0,0,0,0,0,0,0,0,0,0,0,0,0,0,0,0,0,0,0,0,0,0,0,0,0,0,0,0,{"$f":"IF(DB49=$F$47,1,0)","v":0},0]
[]
[{"$nulls":3},"Sans métha",null,{"$f":"IF(F51=1,$AB$160,\"\")","v":""},"","","","","","","","","","","","","","","","","","","","","","","","","","","","","","","",{"$f":"IF(AL51=1,$AB$160,\"\")","v":""},"","","","","","","","","","","","","","","","","","","","","","","","","","","","","","","",{"$f":"IF(BR51=1,$AB$160,\"\")","v":""},"","","","","","","","","","","","","","","","","","","","","","","","","","","","","","","","","","","",{"$f":"IF(DB51=1,$AB$160,\"\")","v":""},""]
[{"$nulls":4},"Y",{"$f":"IFERROR($AC$160*F51,0)","v":0},0,0,0,0,0,0,0,0,0,0,0,0,0,0,0,0,0,0,0,0,0,0,0,0,0,0,0,0,0,0,0,{"$f":"IFERROR($AC$160*AL51,0)","v":0},0,0,0,0,0,0,0,0,0,0,0,0,0,0,0,0,0,0,0,0,0,0,0,0,0,0,0,0,0,0,0,{"$f":"IFERROR($AC$160*BR51,0)","v":0},0,0,0,0,0,0,0,0,0,0,0,0,0,0,0,0,0,0,0,0,0,0,0,0,0,0,0,0,0,0,0,0,0,0,0,{"$f":"IFERROR($AC$160*DB51,0)","v":0},0]
[{"$nulls":4},"HI",{"$f":"IFERROR(VLOOKUP(F53,$R$168:$X$178,3,FALSE)*F51,0)","v":0},0,0,0,0,0,0,0,0,0,0,0,0,0,0,0,0,0,0,0,0,0,0,0,0,0,0,0,0,0,0,0,{"$f":"IFERROR(VLOOKUP(AL53,$R$168:$X$178,3,FALSE)*AL51,0)","v":0},0,0,0,0,0,0,0,0,0,0,0,0,0,0,0,0,0,0,0,0,0,0,0,0,0,0,0,0,0,0,0,{"$f":"IFERROR(VLOOKUP(BR53,$R$168:$X$178,3,FALSE)*BR51,0)","v":0},0,0,0,0,0,0,0,0,0,0,0,0,0,0,0,0,0,0,0,0,0,0,0,0,0,0,0,0,0,0,0,0,0,0,0,{"$f":"IFERROR(VLOOKUP(DB53,$R$168:$X$178,3,FALSE)*DB51,0)","v":0},0]
[]
[{"$nulls":4},"% réduction de la culture suivante",{"$f":"IF(F54>5,(F54-5)*$R$140/100,0)","v":0},0,0,0,0,0,0,0,0,0,0,0,0,0,0,0,0,0,0,0,0,0,0,0,0,0,0,0,0,0,0,0,{"$f":"IF(AL54>5,(AL54-5)*$R$140/100,0)","v":0},0,0,0,0,0,0,0,0,0,0,0,0,0,0,0,0,0,0,0,0,0,0,0,0,0,0,0,0,0,0,0,{"$f":"IF(BR54>5,(BR54-5)*$R$140/100,0)","v":0},0,0,0,0,0,0,0,0,0,0,0,0,0,0,0,0,0,0,0,0,0,0,0,0,0,0,0,0,0,0,0,0,0,0,0,{"$f":"IF(DB54>5,(DB54-5)*$R$140/100,0)","v":0},0]
[{"$nulls":4},"Ccovercrop_AG sans métha",{"$f":"IFERROR(F54*(1-F55)/1*0.44,0)","v":0},0,0,0,0,0,0,0,0,0,0,0,0,0,0,0,0,0,0,0,0,0,0,0,0,0,0,0,0,0,0,0,{"$f":"IFERROR(AL54*(1-AL55)/1*0.44,0)","v":0},0,0,0,0,0,0,0,0,0,0,0,0,0,0,0,0,0,0,0,0,0,0,0,0,0,0,0,0,0,0,0,{"$f":"IFERROR(BR54*(1-BR55)/1*0.44,0)","v":0},0,0,0,0,0,0,0,0,0,0,0,0,0,0,0,0,0,0,0,0,0,0,0,0,0,0,0,0,0,0,0,0,0,0,0,{"$f":"IFERROR(DB54*(1-DB55)/1*0.44,0)","v":0},0]
[]
[]
[{"$nulls":3},"Avec métha",null,{"$f":"IF(F51=1,$Z$160,\"\")","v":""},"","","","","","","","","","","","","","","","","","","","","","","","","","","","","","","",{"$f":"IF(AL51=1,$Z$160,\"\")","v":""},"","","","","","","","","","","","","","","","","","","","","","","","","","","","","","","",{"$f":"IF(BR51=1,$Z$160,\"\")","v":""},"","","","","","","","","","","","","","","","","","","","","","","","","","","","","","","","","","",""]
[{"$nulls":5},{"$f":"IF(F61=\"CIVE d'été\",\"Silage maize\",IF(F61=\"CIVE d'hiver\",\"Silage winter cereals\",\"\"))","v":""},"","","","","","","","","","","","","","","","","","","","","","","","","","","","","","","",{"$f":"IF(AL61=\"CIVE d'été\",\"Silage maize\",IF(AL61=\"CIVE d'hiver\",\"Silage winter cereals\",\"\"))","v":""},"","","","","","","","","","","","","","","","","","","","","","","","","","","","","","","",{"$f":"IF(BR61=\"CIVE d'été\",\"Silage maize\",IF(BR61=\"CIVE d'hiver\",\"Silage winter cereals\",\"\"))","v":""},"","","","","","","","","","","","","","","","","","","","","","","","","","","","","","","",{"$f":"IF(CX61=\"CIVE d'été\",\"Silage maize\",IF(CX61=\"CIVE d'hiver\",\"Silage winter cereals\",\"\"))","v":""},"",""]
[{"$nulls":5},{"$f":"F62","v":""},"","","","","","","","","","","","","","","","","","","","","","","","","","","","","","","",{"$f":"AL62","v":""},"","","","","","","","","","","","","","","","","","","","","","","","","","","","","","","",{"$f":"BR62","v":""},"","","","","","","","","","","","","","","","","","","","","","","","","","","","","","","",{"$f":"CX62","v":""},"","",{"$f":"IF(DA61=$R$178,$R$178,IF(DA61=\"\",\"\",$R$177))","v":""}]
[{"$nulls":4},"Y",{"$f":"$AA$160*F51","v":0},0,0,0,0,0,0,0,0,0,0,0,0,0,0,0,0,0,0,0,0,0,0,0,0,0,0,0,0,0,0,0,{"$f":"$AA$160*AL51","v":0},0,0,0,0,0,0,0,0,0,0,0,0,0,0,0,0,0,0,0,0,0,0,0,0,0,0,0,0,0,0,0,{"$f":"$AA$160*BR51","v":0},0,0,0,0,0,0,0,0,0,0,0,0,0,0,0,0,0,0,0,0,0,0,0,0,0,0,0,0,0,0,0,0,0,0,0,{"$f":"$AA$160*DB51","v":0},0]
[{"$nulls":4},"HI",{"$f":"IFERROR(VLOOKUP(F63,$R$168:$X$178,3,FALSE)*F51,0)","v":0},0,0,0,0,0,0,0,0,0,0,0,0,0,0,0,0,0,0,0,0,0,0,0,0,0,0,0,0,0,0,0,{"$f":"IFERROR(VLOOKUP(AL63,$R$168:$X$178,3,FALSE)*AL51,0)","v":0},0,0,0,0,0,0,0,0,0,0,0,0,0,0,0,0,0,0,0,0,0,0,0,0,0,0,0,0,0,0,0,{"$f":"IFERROR(VLOOKUP(BR63,$R$168:$X$178,3,FALSE)*BR51,0)","v":0},0,0,0,0,0,0,0,0,0,0,0,0,0,0,0,0,0,0,0,0,0,0,0,0,0,0,0,0,0,0,0,0,0,0,0,{"$f":"IFERROR(VLOOKUP(DB63,$R$168:$X$178,3,FALSE)*DB51,0)","v":0},0]
[]
[{"$nulls":4},"% réduction de la culture suivante",{"$f":"IF(F64>5,(F64-5)*$R$140/100,0)","v":0},{"$f":"IF(G64>5,(G64-5)*$R$140/100,0)","v":0},0,0,0,0,0,0,0,0,0,0,0,0,0,0,0,0,0,0,0,0,0,0,0,0,0,0,0,0,0,0,{"$f":"IF(AL64>5,(AL64-5)*$R$140/100,0)","v":0},0,0,0,0,0,0,0,0,0,0,0,0,0,0,0,0,0,0,0,0,0,0,0,0,0,0,0,0,0,0,0,{"$f":"IF(BR64>5,(BR64-5)*$R$140/100,0)","v":0},0,0,0,0,0,0,0,0,0,0,0,0,0,0,0,0,0,0,0,0,0,0,0,0,0,0,0,0,0,0,0,0,0,0,0,{"$f":"IF(DB64>5,(DB64-5)*$R$140/100,0)","v":0},0]
[{"$nulls":4},"Ccovercrop_AG avec métha",{"$f":"IFERROR(F64*(1-F65)/F65*0.44,0)","v":0},0,0,0,0,0,0,0,0,0,0,0,0,0,0,0,0,0,0,0,0,0,0,0,0,0,0,0,0,0,0,0,{"$f":"IFERROR(AL64*(1-AL65)/AL65*0.44,0)","v":0},0,0,0,0,0,0,0,0,0,0,0,0,0,0,0,0,0,0,0,0,0,0,0,0,0,0,0,0,0,0,0,{"$f":"IFERROR(BR64*(1-BR65)/BR65*0.44,0)","v":0},0,0,0,0,0,0,0,0,0,0,0,0,0,0,0,0,0,0,0,0,0,0,0,0,0,0,0,0,0,0,0,0,0,0,0,{"$f":"IFERROR(DB64*(1-DB65)/DB65*0.44,0)","v":0},0]
[{"$nulls":4},"Charvested covercrop_AG avec métha",{"$f":"IFERROR(F64*(F65)/(F65)*0.44,0)","v":0},0,0,0,0,0,0,0,0,0,0,0,0,0,0,0,0,0,0,0,0,0,0,0,0,0,0,0,0,0,0,0,{"$f":"IFERROR(AL64*(AL65)/(AL65)*0.44,0)","v":0},0,0,0,0,0,0,0,0,0,0,0,0,0,0,0,0,0,0,0,0,0,0,0,0,0,0,0,0,0,0,0,{"$f":"IFERROR(BR64*(BR65)/(BR65)*0.44,0)","v":0},0,0,0,0,0,0,0,0,0,0,0,0,0,0,0,0,0,0,0,0,0,0,0,0,0,0,0,0,0,0,0,0,0,0,0,{"$f":"IFERROR(DB64*(DB65)/(DB65)*0.44,0)","v":0},0]
[{"$nulls":3},"C retour au sol par le digestat","%Cdig",{"$f":"F69*0.2","v":0},0,0,0,0,0,0,0,0,0,0,0,0,0,0,0,0,0,0,0,0,0,0,0,0,0,0,0,0,0,0,0,{"$f":"AL69*0.2","v":0},0,0,0,0,0,0,0,0,0,0,0,0,0,0,0,0,0,0,0,0,0,0,0,0,0,0,0,0,0,0,0,{"$f":"BR69*0.2","v":0},0,0,0,0,0,0,0,0,0,0,0,0,0,0,0,0,0,0,0,0,0,0,0,0,0,0,0,0,0,0,0,{"$f":"CX69*0.2","v":0},{"$f":"CY69*0.2","v":0},{"$f":"CZ69*0.2","v":0},{"$f":"DA69*0.2","v":0},{"$f":"DB69*0.2","v":0},0]
[]
[]
[null,null,"Ccrop_BG","Paramètre","SRR",{"$f":"IFERROR(VLOOKUP(F36,$R$168:$X$178,4,FALSE),0)","v":0},0,0,0,0,0,0,0,0,0,0,0,0,0,0,0,0,0,0,0,0,0,0,0,0,0,0,0,0,0,0,0,{"$f":"IFERROR(VLOOKUP(AL36,$R$168:$X$178,4,FALSE),0)","v":0},0,0,0,0,0,0,0,0,0,0,0,0,0,0,0,0,0,0,0,0,0,0,0,0,0,0,0,0,0,0,0,{"$f":"IFERROR(VLOOKUP(BR36,$R$168:$X$178,4,FALSE),0)","v":0},0,0,0,0,0,0,0,0,0,0,0,0,0,0,0,0,0,0,0,0,0,0,0,0,0,0,0,0,0,0,0,0,0,0,0,{"$f":"IFERROR(VLOOKUP(DB36,$R$168:$X$178,4,FALSE),0)","v":0},0]
[{"$nulls":3},"Paramètre","beta",{"$f":"IFERROR(VLOOKUP(F36,$R$168:$X$178,5,FALSE),0)","v":0},0,0,0,0,0,0,0,0,0,0,0,0,0,0,0,0,0,0,0,0,0,0,0,0,0,0,0,0,0,0,0,{"$f":"IFERROR(VLOOKUP(AL36,$R$168:$X$178,5,FALSE),0)","v":0},0,0,0,0,0,0,0,0,0,0,0,0,0,0,0,0,0,0,0,0,0,0,0,0,0,0,0,0,0,0,0,{"$f":"IFERROR(VLOOKUP(BR36,$R$168:$X$178,5,FALSE),0)","v":0},0,0,0,0,0,0,0,0,0,0,0,0,0,0,0,0,0,0,0,0,0,0,0,0,0,0,0,0,0,0,0,0,0,0,0,{"$f":"IFERROR(VLOOKUP(DB36,$R$168:$X$178,5,FALSE),0)","v":0},0]
[{"$nulls":3},"Calcul","Ccrop_BG sans métha",{"$f":"IFERROR(1.65*F38/(F40*F73)*(1-F74^($R$146))*0.4,0)","v":0},0,0,0,0,0,0,0,0,0,0,0,0,0,0,0,0,0,0,0,0,0,0,0,0,0,0,0,0,0,0,0,{"$f":"IFERROR(1.65*AL38/(AL40*AL73)*(1-AL74^($R$146))*0.4,0)","v":0},0,0,0,0,0,0,0,0,0,0,0,0,0,0,0,0,0,0,0,0,0,0,0,0,0,0,0,0,0,0,0,{"$f":"IFERROR(1.65*BR38/(BR40*BR73)*(1-BR74^($R$146))*0.4,0)","v":0},0,0,0,0,0,0,0,0,0,0,0,0,0,0,0,0,0,0,0,0,0,0,0,0,0,0,0,0,0,0,0,{"$f":"IFERROR(1.65*CX38/(CX40*CX73)*(1-CX74^($R$146))*0.4,0)","v":0},{"$f":"IFERROR(1.65*CY38/(CY40*CY73)*(1-CY74^($R$146))*0.4,0)","v":0},{"$f":"IFERROR(1.65*CZ38/(CZ40*CZ73)*(1-CZ74^($R$146))*0.4,0)","v":0},{"$f":"IFERROR(1.65*DA38/(DA40*DA73)*(1-DA74^($R$146))*0.4,0)","v":0},{"$f":"IFERROR(1.65*DB38/(DB40*DB73)*(1-DB74^($R$146))*0.4,0)","v":0},0]
[{"$nulls":4},"Ccrop_BG avec métha",{"$f":"IFERROR(1.65*F39/(F40*F73)*(1-F74^($R$146))*0.4,0)","v":0},0,0,0,0,0,0,0,0,0,0,0,0,0,0,0,0,0,0,0,0,0,0,0,0,0,0,0,0,0,0,0,{"$f":"IFERROR(1.65*AL39/(AL40*AL73)*(1-AL74^($R$146))*0.4,0)","v":0},0,0,0,0,0,0,0,0,0,0,0,0,0,0,0,0,0,0,0,0,0,0,0,0,0,0,0,0,0,0,0,{"$f":"IFERROR(1.65*BR39/(BR40*BR73)*(1-BR74^($R$146))*0.4,0)","v":0},0,0,0,0,0,0,0,0,0,0,0,0,0,0,0,0,0,0,0,0,0,0,0,0,0,0,0,0,0,0,0,0,0,0,0,{"$f":"IFERROR(1.65*DB39/(DB40*DB73)*(1-DB74^($R$146))*0.4,0)","v":0},0]
[]
[{"$nulls":3},"Culture de couverture"]
[{"$nulls":3},"Sans métha","SRR",{"$f":"IFERROR(VLOOKUP(F53,$R$168:$X$178,4,FALSE)*F51,0)","v":0},0,0,0,0,0,0,0,0,0,0,0,0,0,0,0,0,0,0,0,0,0,0,0,0,0,0,0,0,0,0,0,{"$f":"IFERROR(VLOOKUP(AL53,$R$168:$X$178,4,FALSE)*AL51,0)","v":0},0,0,0,0,0,0,0,0,0,0,0,0,0,0,0,0,0,0,0,0,0,0,0,0,0,0,0,0,0,0,0,{"$f":"IFERROR(VLOOKUP(BR53,$R$168:$X$178,4,FALSE)*BR51,0)","v":0},0,0,0,0,0,0,0,0,0,0,0,0,0,0,0,0,0,0,0,0,0,0,0,0,0,0,0,0,0,0,0,0,0,0,0,{"$f":"IFERROR(VLOOKUP(DB53,$R$168:$X$178,4,FALSE)*DB51,0)","v":0},0]
[{"$nulls":4},"beta",{"$f":"IFERROR(VLOOKUP(F53,$R$168:$X$178,5,FALSE)*F51,0)","v":0},0,0,0,0,0,0,0,0,0,0,0,0,0,0,0,0,0,0,0,0,0,0,0,0,0,0,0,0,0,0,0,{"$f":"IFERROR(VLOOKUP(AL53,$R$168:$X$178,5,FALSE)*AL51,0)","v":0},0,0,0,0,0,0,0,0,0,0,0,0,0,0,0,0,0,0,0,0,0,0,0,0,0,0,0,0,0,0,0,{"$f":"IFERROR(VLOOKUP(BR53,$R$168:$X$178,5,FALSE)*BR51,0)","v":0},0,0,0,0,0,0,0,0,0,0,0,0,0,0,0,0,0,0,0,0,0,0,0,0,0,0,0,0,0,0,0,0,0,0,0,{"$f":"IFERROR(VLOOKUP(DB53,$R$168:$X$178,5,FALSE)*DB51,0)","v":0},0]
[{"$nulls":4},"Ccovercrop_BG sans métha",{"$f":"IFERROR(1.65*F54/(1*F79)*(1-F80^($R$146))*0.4,0)","v":0},0,0,0,0,0,0,0,0,0,0,0,0,0,0,0,0,0,0,0,0,0,0,0,0,0,0,0,0,0,0,0,{"$f":"IFERROR(1.65*AL54/(1*AL79)*(1-AL80^($R$146))*0.4,0)","v":0},0,0,0,0,0,0,0,0,0,0,0,0,0,0,0,0,0,0,0,0,0,0,0,0,0,0,0,0,0,0,0,{"$f":"IFERROR(1.65*BR54/(1*BR79)*(1-BR80^($R$146))*0.4,0)","v":0},0,0,0,0,0,0,0,0,0,0,0,0,0,0,0,0,0,0,0,0,0,0,0,0,0,0,0,0,0,0,0,{"$f":"IFERROR(1.65*CX54/(1*CX79)*(1-CX80^($R$146))*0.4,0)","v":0},{"$f":"IFERROR(1.65*CY54/(1*CY79)*(1-CY80^($R$146))*0.4,0)","v":0},{"$f":"IFERROR(1.65*CZ54/(1*CZ79)*(1-CZ80^($R$146))*0.4,0)","v":0},{"$f":"IFERROR(1.65*DA54/(1*DA79)*(1-DA80^($R$146))*0.4,0)","v":0},{"$f":"IFERROR(1.65*DB54/(1*DB79)*(1-DB80^($R$146))*0.4,0)","v":0},0]
[]
[]
[{"$nulls":3},"Avec métha","SRR",{"$f":"IFERROR(VLOOKUP(F63,$R$168:$X$178,4,FALSE)*F51,0)","v":0},0,0,0,0,0,0,0,0,0,0,0,0,0,0,0,0,0,0,0,0,0,0,0,0,0,0,0,0,0,0,0,{"$f":"IFERROR(VLOOKUP(AL63,$R$168:$X$178,4,FALSE)*AL51,0)","v":0},0,0,0,0,0,0,0,0,0,0,0,0,0,0,0,0,0,0,0,0,0,0,0,0,0,0,0,0,0,0,0,{"$f":"IFERROR(VLOOKUP(BR63,$R$168:$X$178,4,FALSE)*BR51,0)","v":0},0,0,0,0,0,0,0,0,0,0,0,0,0,0,0,0,0,0,0,0,0,0,0,0,0,0,0,0,0,0,0,0,0,0,0,{"$f":"IFERROR(VLOOKUP(DB63,$R$168:$X$178,4,FALSE)*DB51,0)","v":0},0]
[{"$nulls":4},"beta",{"$f":"IFERROR(VLOOKUP(F63,$R$168:$X$178,5,FALSE)*F51,0)","v":0},0,0,0,0,0,0,0,0,0,0,0,0,0,0,0,0,0,0,0,0,0,0,0,0,0,0,0,0,0,0,0,{"$f":"IFERROR(VLOOKUP(AL63,$R$168:$X$178,5,FALSE)*AL51,0)","v":0},0,0,0,0,0,0,0,0,0,0,0,0,0,0,0,0,0,0,0,0,0,0,0,0,0,0,0,0,0,0,0,{"$f":"IFERROR(VLOOKUP(BR63,$R$168:$X$178,5,FALSE)*BR51,0)","v":0},0,0,0,0,0,0,0,0,0,0,0,0,0,0,0,0,0,0,0,0,0,0,0,0,0,0,0,0,0,0,0,0,0,0,0,{"$f":"IFERROR(VLOOKUP(DB63,$R$168:$X$178,5,FALSE)*DB51,0)","v":0},0]
[{"$nulls":4},"Ccovercrop_BG avec métha",{"$f":"IFERROR(1.65*F64/(F65*F84)*(1-F85^($R$146))*0.4,0)","v":0},0,0,0,0,0,0,0,0,0,0,0,0,0,0,0,0,0,0,0,0,0,0,0,0,0,0,0,0,0,0,0,{"$f":"IFERROR(1.65*AL64/(AL65*AL84)*(1-AL85^($R$146))*0.4,0)","v":0},0,0,0,0,0,0,0,0,0,0,0,0,0,0,0,0,0,0,0,0,0,0,0,0,0,0,0,0,0,0,0,{"$f":"IFERROR(1.65*BR64/(BR65*BR84)*(1-BR85^($R$146))*0.4,0)","v":0},0,0,0,0,0,0,0,0,0,0,0,0,0,0,0,0,0,0,0,0,0,0,0,0,0,0,0,0,0,0,0,{"$f":"IFERROR(1.65*CX64/(CX65*CX84)*(1-CX85^($R$146))*0.4,0)","v":0},{"$f":"IFERROR(1.65*CY64/(CY65*CY84)*(1-CY85^($R$146))*0.4,0)","v":0},{"$f":"IFERROR(1.65*CZ64/(CZ65*CZ84)*(1-CZ85^($R$146))*0.4,0)","v":0},{"$f":"IFERROR(1.65*DA64/(DA65*DA84)*(1-DA85^($R$146))*0.4,0)","v":0},{"$f":"IFERROR(1.65*DB64/(DB65*DB84)*(1-DB85^($R$146))*0.4,0)","v":0},0]
[]
[]
[null,null,"Calcul C hum input",null,"Hag",{"$f":"IFERROR(VLOOKUP(F36,$R$168:$X$178,6,FALSE),0)","v":0},0,0,0,0,0,0,0,0,0,0,0,0,0,0,0,0,0,0,0,0,0,0,0,0,0,0,0,0,0,0,0,{"$f":"IFERROR(VLOOKUP(AL36,$R$168:$X$178,6,FALSE),0)","v":0},0,0,0,0,0,0,0,0,0,0,0,0,0,0,0,0,0,0,0,0,0,0,0,0,0,0,0,0,0,0,0,{"$f":"IFERROR(VLOOKUP(BR36,$R$168:$X$178,6,FALSE),0)","v":0},0,0,0,0,0,0,0,0,0,0,0,0,0,0,0,0,0,0,0,0,0,0,0,0,0,0,0,0,0,0,0,0,0,0,0,{"$f":"IFERROR(VLOOKUP(DB36,$R$168:$X$178,6,FALSE),0)","v":0},0]
[{"$nulls":4},"Hbg",{"$f":"IFERROR(VLOOKUP(F36,$R$168:$X$178,7,FALSE),0)","v":0},0,0,0,0,0,0,0,0,0,0,0,0,0,0,0,0,0,0,0,0,0,0,0,0,0,0,0,0,0,0,0,{"$f":"IFERROR(VLOOKUP(AL36,$R$168:$X$178,7,FALSE),0)","v":0},0,0,0,0,0,0,0,0,0,0,0,0,0,0,0,0,0,0,0,0,0,0,0,0,0,0,0,0,0,0,0,{"$f":"IFERROR(VLOOKUP(BR36,$R$168:$X$178,7,FALSE),0)","v":0},0,0,0,0,0,0,0,0,0,0,0,0,0,0,0,0,0,0,0,0,0,0,0,0,0,0,0,0,0,0,0,0,0,0,0,{"$f":"IFERROR(VLOOKUP(DB36,$R$168:$X$178,7,FALSE),0)","v":0},0]
[{"$nulls":3},"Sans métha","Cab",{"$f":"F41*F89","v":0},0,0,0,0,0,0,0,0,0,0,0,0,0,0,0,0,0,0,0,0,0,0,0,0,0,0,0,0,0,0,0,{"$f":"AL41*AL89","v":0},0,0,0,0,0,0,0,0,0,0,0,0,0,0,0,0,0,0,0,0,0,0,0,0,0,0,0,0,0,0,0,{"$f":"BR41*BR89","v":0},0,0,0,0,0,0,0,0,0,0,0,0,0,0,0,0,0,0,0,0,0,0,0,0,0,0,0,0,0,0,0,0,0,0,0,{"$f":"DB41*DB89","v":0},0]
[{"$nulls":4},"Cbg",{"$f":"F75*F90","v":0},0,0,0,0,0,0,0,0,0,0,0,0,0,0,0,0,0,0,0,0,0,0,0,0,0,0,0,0,0,0,0,{"$f":"AL75*AL90","v":0},0,0,0,0,0,0,0,0,0,0,0,0,0,0,0,0,0,0,0,0,0,0,0,0,0,0,0,0,0,0,0,{"$f":"BR75*BR90","v":0},0,0,0,0,0,0,0,0,0,0,0,0,0,0,0,0,0,0,0,0,0,0,0,0,0,0,0,0,0,0,0,0,0,0,0,{"$f":"DB75*DB90","v":0},0]
[]
[{"$nulls":3},"CC","Hag",{"$f":"IFERROR(VLOOKUP(F53,$R$168:$X$178,6,FALSE)*F51,0)","v":0},0,0,0,0,0,0,0,0,0,0,0,0,0,0,0,0,0,0,0,0,0,0,0,0,0,0,0,0,0,0,0,{"$f":"IFERROR(VLOOKUP(AL53,$R$168:$X$178,6,FALSE)*AL51,0)","v":0},0,0,0,0,0,0,0,0,0,0,0,0,0,0,0,0,0,0,0,0,0,0,0,0,0,0,0,0,0,0,0,{"$f":"IFERROR(VLOOKUP(BR53,$R$168:$X$178,6,FALSE)*BR51,0)","v":0},0,0,0,0,0,0,0,0,0,0,0,0,0,0,0,0,0,0,0,0,0,0,0,0,0,0,0,0,0,0,0,0,0,0,0,{"$f":"IFERROR(VLOOKUP(DB53,$R$168:$X$178,6,FALSE)*DB51,0)","v":0},0]
[{"$nulls":4},"Hbg",{"$f":"IFERROR(VLOOKUP(F53,$R$168:$X$178,7,FALSE)*F51,0)","v":0},0,0,0,0,0,0,0,0,0,0,0,0,0,0,0,0,0,0,0,0,0,0,0,0,0,0,0,0,0,0,0,{"$f":"IFERROR(VLOOKUP(AL53,$R$168:$X$178,7,FALSE)*AL51,0)","v":0},0,0,0,0,0,0,0,0,0,0,0,0,0,0,0,0,0,0,0,0,0,0,0,0,0,0,0,0,0,0,0,{"$f":"IFERROR(VLOOKUP(BR53,$R$168:$X$178,7,FALSE)*BR51,0)","v":0},0,0,0,0,0,0,0,0,0,0,0,0,0,0,0,0,0,0,0,0,0,0,0,0,0,0,0,0,0,0,0,0,0,0,0,{"$f":"IFERROR(VLOOKUP(DB53,$R$168:$X$178,7,FALSE)*DB51,0)","v":0},0]
[{"$nulls":4},"CCab",{"$f":"F58*F94","v":0},0,0,0,0,0,0,0,0,0,0,0,0,0,0,0,0,0,0,0,0,0,0,0,0,0,0,0,0,0,0,0,{"$f":"AL58*AL94","v":0},0,0,0,0,0,0,0,0,0,0,0,0,0,0,0,0,0,0,0,0,0,0,0,0,0,0,0,0,0,0,0,{"$f":"BR58*BR94","v":0},0,0,0,0,0,0,0,0,0,0,0,0,0,0,0,0,0,0,0,0,0,0,0,0,0,0,0,0,0,0,0,0,0,0,0,{"$f":"DB58*DB94","v":0},0]
[{"$nulls":4},"CCbg",{"$f":"F81*F95","v":0},0,0,0,0,0,0,0,0,0,0,0,0,0,0,0,0,0,0,0,0,0,0,0,0,0,0,0,0,0,0,0,{"$f":"AL81*AL95","v":0},0,0,0,0,0,0,0,0,0,0,0,0,0,0,0,0,0,0,0,0,0,0,0,0,0,0,0,0,0,0,0,{"$f":"BR81*BR95","v":0},0,0,0,0,0,0,0,0,0,0,0,0,0,0,0,0,0,0,0,0,0,0,0,0,0,0,0,0,0,0,0,0,0,0,0,{"$f":"DB81*DB95","v":0},0]
[]
[{"$nulls":3},"avec métha"]
[{"$nulls":3},"Calcul","Cab",{"$f":"F42*F89","v":0},0,0,0,0,0,0,0,0,0,0,0,0,0,0,0,0,0,0,0,0,0,0,0,0,0,0,0,0,0,0,0,{"$f":"AL42*AL89","v":0},0,0,0,0,0,0,0,0,0,0,0,0,0,0,0,0,0,0,0,0,0,0,0,0,0,0,0,0,0,0,0,{"$f":"BR42*BR89","v":0},0,0,0,0,0,0,0,0,0,0,0,0,0,0,0,0,0,0,0,0,0,0,0,0,0,0,0,0,0,0,0,0,0,0,0,{"$f":"DB42*DB89","v":0},0]
[{"$nulls":4},"Cbg",{"$f":"F76*F90","v":0},0,0,0,0,0,0,0,0,0,0,0,0,0,0,0,0,0,0,0,0,0,0,0,0,0,0,0,0,0,0,0,{"$f":"AL76*AL90","v":0},0,0,0,0,0,0,0,0,0,0,0,0,0,0,0,0,0,0,0,0,0,0,0,0,0,0,0,0,0,0,0,{"$f":"BR76*BR90","v":0},0,0,0,0,0,0,0,0,0,0,0,0,0,0,0,0,0,0,0,0,0,0,0,0,0,0,0,0,0,0,0,0,0,0,0,{"$f":"DB76*DB90","v":0},0]
[]
[{"$nulls":3},"CC avec métha","Hag",{"$f":"IFERROR(VLOOKUP(F63,$R$168:$X$178,6,FALSE)*F51,0)","v":0},0,0,0,0,0,0,0,0,0,0,0,0,0,0,0,0,0,0,0,0,0,0,0,0,0,0,0,0,0,0,0,{"$f":"IFERROR(VLOOKUP(AL63,$R$168:$X$178,6,FALSE)*AL51,0)","v":0},0,0,0,0,0,0,0,0,0,0,0,0,0,0,0,0,0,0,0,0,0,0,0,0,0,0,0,0,0,0,0,{"$f":"IFERROR(VLOOKUP(BR63,$R$168:$X$178,6,FALSE)*BR51,0)","v":0},0,0,0,0,0,0,0,0,0,0,0,0,0,0,0,0,0,0,0,0,0,0,0,0,0,0,0,0,0,0,0,0,0,0,0,{"$f":"IFERROR(VLOOKUP(DB63,$R$168:$X$178,6,FALSE)*DB51,0)","v":0},0]
[{"$nulls":4},"Hbg",{"$f":"IFERROR(VLOOKUP(F63,$R$168:$X$178,7,FALSE)*F51,0)","v":0},0,0,0,0,0,0,0,0,0,0,0,0,0,0,0,0,0,0,0,0,0,0,0,0,0,0,0,0,0,0,0,{"$f":"IFERROR(VLOOKUP(AL63,$R$168:$X$178,7,FALSE)*AL51,0)","v":0},0,0,0,0,0,0,0,0,0,0,0,0,0,0,0,0,0,0,0,0,0,0,0,0,0,0,0,0,0,0,0,{"$f":"IFERROR(VLOOKUP(BR63,$R$168:$X$178,7,FALSE)*BR51,0)","v":0},0,0,0,0,0,0,0,0,0,0,0,0,0,0,0,0,0,0,0,0,0,0,0,0,0,0,0,0,0,0,0,0,0,0,0,{"$f":"IFERROR(VLOOKUP(DB63,$R$168:$X$178,7,FALSE)*DB51,0)","v":0},0]
[{"$nulls":4},"CCab",{"$f":"F68*F103","v":0},0,0,0,0,0,0,0,0,0,0,0,0,0,0,0,0,0,0,0,0,0,0,0,0,0,0,0,0,0,0,0,{"$f":"AL68*AL103","v":0},0,0,0,0,0,0,0,0,0,0,0,0,0,0,0,0,0,0,0,0,0,0,0,0,0,0,0,0,0,0,0,{"$f":"BR68*BR103","v":0},0,0,0,0,0,0,0,0,0,0,0,0,0,0,0,0,0,0,0,0,0,0,0,0,0,0,0,0,0,0,0,0,0,0,0,{"$f":"DB68*DB103","v":0},0]
[{"$nulls":4},"CCbg",{"$f":"F86*F104","v":0},0,0,0,0,0,0,0,0,0,0,0,0,0,0,0,0,0,0,0,0,0,0,0,0,0,0,0,0,0,0,0,{"$f":"AL86*AL104","v":0},0,0,0,0,0,0,0,0,0,0,0,0,0,0,0,0,0,0,0,0,0,0,0,0,0,0,0,0,0,0,0,{"$f":"BR86*BR104","v":0},0,0,0,0,0,0,0,0,0,0,0,0,0,0,0,0,0,0,0,0,0,0,0,0,0,0,0,0,0,0,0,0,0,0,0,{"$f":"DB86*DB104","v":0},0]
[]
[{"$nulls":4},"Hdig",0.5,0.5,0.5,0.5,0.5,0.5,0.5,0.5,0.5,0.5,0.5,0.5,0.5,0.5,0.5,0.5,0.5,0.5,0.5,0.5,0.5,0.5,0.5,0.5,0.5,0.5,0.5,0.5,0.5,0.5,0.5,0.5,0.5,0.5,0.5,0.5,0.5,0.5,0.5,0.5,0.5,0.5,0.5,0.5,0.5,0.5,0.5,0.5,0.5,0.5,0.5,0.5,0.5,0.5,0.5,0.5,0.5,0.5,0.5,0.5,0.5,0.5,0.5,0.5,0.5,0.5,0.5,0.5,0.5,0.5,0.5,0.5,0.5,0.5,0.5,0.5,0.5,0.5,0.5,0.5,0.5,0.5,0.5,0.5,0.5,0.5,0.5,0.5,0.5,0.5,0.5,0.5,0.5,0.5,0.5,0.5,0.5,0.5,0.5,0.5,1.5,2.5]
[{"$nulls":4},"Cdig",{"$f":"F108*F70","v":0},{"$f":"G108*G70","v":0},0,0,0,0,0,0,0,0,0,0,0,0,0,0,0,0,0,0,0,0,0,0,0,0,0,0,0,0,0,0,{"$f":"AL108*AL70","v":0},0,0,0,0,0,0,0,0,0,0,0,0,0,0,0,0,0,0,0,0,0,0,0,0,0,0,0,0,0,0,0,{"$f":"BR108*BR70","v":0},0,0,0,0,0,0,0,0,0,0,0,0,0,0,0,0,0,0,0,0,0,0,0,0,0,0,0,0,0,0,0,{"$f":"CX108*CX70","v":0},{"$f":"CY108*CY70","v":0},{"$f":"CZ108*CZ70","v":0},{"$f":"DA108*DA70","v":0},{"$f":"DB108*DB70","v":0},0]
[]
[null,"Récapitulatif calcul C hum input",{"$nulls":3},"Tableau S5","Cab","Cbg","CCab","CCbg",null,"Chum",null,"Tableau S6",null,"Tableau S5","Cab","Cbg","CCab","CCbg",null,"Chum",null,"Tableau S6",null,"Tableau S5","Cab","Cbg","CCab","CCbg",null,"Chum",null,"Tableau S6"]
[null,"à horizon 30 ans",null,null,"à 20 ans","Sans métha",{"$f":"SUM(F91:Y91)/R142","v":{"v":0,"d":"0.0000"}},{"$f":"SUM(F92:Y92)/R142","v":{"v":0,"d":"0.0000"}},{"$f":"SUM(F96:Y96)/R142","v":{"v":0,"d":"0.0000"}},{"$f":"SUM(F97:Y97)/R142","v":{"v":0,"d":"0.0000"}},null,{"$f":"SUM(G112:K112)","v":{"v":0,"d":"0.0000"}},null,"Différence","à 30 ans","Sans métha",{"$f":"SUM(F91:AI91)/R143","v":{"v":0,"d":"0.0000"}},{"$f":"SUM(F92:AI92)/R143","v":{"v":0,"d":"0.0000"}},{"$f":"SUM(F96:AI96)/R143","v":{"v":0,"d":"0.0000"}},{"$f":"SUM(F97:AI97)/R143","v":{"v":0,"d":"0.0000"}},null,{"$f":"SUM(Q112:U112)","v":{"v":0,"d":"0.0000"}},null,"Différence","à 100 ans","Sans métha",{"$f":"SUM(F91:DA91)/R144","v":{"v":0,"d":"0.0000"}},{"$f":"SUM(F92:DA92)/R144","v":{"v":0,"d":"0.0000"}},{"$f":"SUM(F96:DA96)/R144","v":{"v":0,"d":"0.0000"}},{"$f":"SUM(F97:DA97)/R144","v":{"v":0,"d":"0.0000"}},null,{"$f":"SUM(AA112:AE112)","v":{"v":0,"d":"0.0000"}},null,"Différence"]
[{"$nulls":5},"Avec métha",{"$f":"SUM(F100:Y100)/R142","v":{"v":0,"d":"0.0000"}},{"$f":"SUM(F101:Y101)/R142","v":{"v":0,"d":"0.0000"}},{"$f":"SUM(F105:Y105)/R142","v":{"v":0,"d":"0.0000"}},{"$f":"SUM(F106:Y106)/R142","v":{"v":0,"d":"0.0000"}},{"$f":"SUM(F109:Y109)/R142","v":0},{"$f":"SUM(G113:K113)","v":{"v":0,"d":"0.0000"}},null,{"$f":"L113-L112","v":{"v":0,"d":"0.0000"}},null,"Avec métha",{"$f":"SUM(F100:AI100)/R143","v":{"v":0,"d":"0.0000"}},{"$f":"SUM(F101:AI101)/R143","v":{"v":0,"d":"0.0000"}},{"$f":"SUM(F105:AI105)/R143","v":{"v":0,"d":"0.0000"}},{"$f":"SUM(F106:AI106)/R143","v":{"v":0,"d":"0.0000"}},{"$f":"SUM(F109:AI109)/R143","v":0},{"$f":"SUM(Q113:U113)","v":{"v":0,"d":"0.0000"}},null,{"$f":"V113-V112","v":{"v":0,"d":"0.0000"}},null,"Avec métha",{"$f":"SUM(F100:DA100)/R144","v":{"v":0,"d":"0.0000"}},{"$f":"SUM(F101:DA101)/R144","v":{"v":0,"d":"0.0000"}},{"$f":"SUM(F105:DA105)/R144","v":{"v":0,"d":"0.0000"}},{"$f":"SUM(F106:DA106)/R144","v":{"v":0,"d":"0.0000"}},{"$f":"SUM(F109:DA109)/R144","v":0},{"$f":"SUM(AA113:AE113)","v":{"v":0,"d":"0.0000"}},null,{"$f":"AF113-AF112","v":{"v":0,"d":"0.0000"}}]
[]
[{"$nulls":4},0,1,2,3,4,5,6,7,8,9,10,11,12,13,14,15,16,17,18,19,20,21,22,23,24,25,26,27,28,29,30,31,32,33,34,35,36,37,38,39,40,41,42,43,44,45,46,47,48,49,50,51,52,53,54,55,56,57,58,59,60,61,62,63,64,65,66,67,68,69,70,71,72,73,74,75,76,77,78,79,80,81,82,83,84,85,86,87,88,89,90,91,92,93,94,95,96,97,98,99,100,101,102]
[null,"Evolution des variables durant les 30 ans",null,null,"C hum apport sans métha",{"$f":"F91+F92+F96+F97","v":0},0,0,0,0,0,0,0,0,0,0,0,0,0,0,0,0,0,0,0,0,0,0,0,0,0,0,0,0,0,0,0,{"$f":"AL91+AL92+AL96+AL97","v":0},0,0,0,0,0,0,0,0,0,0,0,0,0,0,0,0,0,0,0,0,0,0,0,0,0,0,0,0,0,0,0,{"$f":"BR91+BR92+BR96+BR97","v":0},0,0,0,0,0,0,0,0,0,0,0,0,0,0,0,0,0,0,0,0,0,0,0,0,0,0,0,0,0,0,0,0,0,0,0,{"$f":"DB91+DB92+DB96+DB97","v":0},0]
[{"$nulls":4},"Dégradation du C actif par rapport à l'année n-1",{"$f":"E119*$F$135","v":{"$error":"#N/A"}},{"$error":"#N/A"},{"$error":"#N/A"},{"$error":"#N/A"},{"$error":"#N/A"},{"$error":"#N/A"},{"$error":"#N/A"},{"$error":"#N/A"},{"$error":"#N/A"},{"$error":"#N/A"},{"$error":"#N/A"},{"$error":"#N/A"},{"$error":"#N/A"},{"$error":"#N/A"},{"$error":"#N/A"},{"$error":"#N/A"},{"$error":"#N/A"},{"$error":"#N/A"},{"$error":"#N/A"},{"$error":"#N/A"},{"$error":"#N/A"},{"$error":"#N/A"},{"$error":"#N/A"},{"$error":"#N/A"},{"$error":"#N/A"},{"$error":"#N/A"},{"$error":"#N/A"},{"$error":"#N/A"},{"$error":"#N/A"},{"$error":"#N/A"},{"$error":"#N/A"},{"$error":"#N/A"},{"$f":"AK119*$F$135","v":{"$error":"#N/A"}},{"$error":"#N/A"},{"$error":"#N/A"},{"$error":"#N/A"},{"$error":"#N/A"},{"$error":"#N/A"},{"$error":"#N/A"},{"$error":"#N/A"},{"$error":"#N/A"},{"$error":"#N/A"},{"$error":"#N/A"},{"$error":"#N/A"},{"$error":"#N/A"},{"$error":"#N/A"},{"$error":"#N/A"},{"$error":"#N/A"},{"$error":"#N/A"},{"$error":"#N/A"},{"$error":"#N/A"},{"$error":"#N/A"},{"$error":"#N/A"},{"$error":"#N/A"},{"$error":"#N/A"},{"$error":"#N/A"},{"$error":"#N/A"},{"$error":"#N/A"},{"$error":"#N/A"},{"$error":"#N/A"},{"$error":"#N/A"},{"$error":"#N/A"},{"$error":"#N/A"},{"$error":"#N/A"},{"$f":"BQ119*$F$135","v":{"$error":"#N/A"}},{"$error":"#N/A"},{"$error":"#N/A"},{"$error":"#N/A"},{"$error":"#N/A"},{"$error":"#N/A"},{"$error":"#N/A"},{"$error":"#N/A"},{"$error":"#N/A"},{"$error":"#N/A"},{"$error":"#N/A"},{"$error":"#N/A"},{"$error":"#N/A"},{"$error":"#N/A"},{"$error":"#N/A"},{"$error":"#N/A"},{"$error":"#N/A"},{"$error":"#N/A"},{"$error":"#N/A"},{"$error":"#N/A"},{"$error":"#N/A"},{"$error":"#N/A"},{"$error":"#N/A"},{"$error":"#N/A"},{"$error":"#N/A"},{"$error":"#N/A"},{"$error":"#N/A"},{"$error":"#N/A"},{"$error":"#N/A"},{"$error":"#N/A"},{"$error":"#N/A"},{"$error":"#N/A"},{"$error":"#N/A"},{"$error":"#N/A"},{"$error":"#N/A"},{"$error":"#N/A"},{"$f":"DA119*$F$135","v":{"$error":"#N/A"}},{"$f":"DB119*$F$135","v":{"$error":"#N/A"}}]
[{"$nulls":4},"Différence apport - dégradation",{"$f":"F116-F117","v":{"$error":"#N/A"}},{"$error":"#N/A"},{"$error":"#N/A"},{"$error":"#N/A"},{"$error":"#N/A"},{"$error":"#N/A"},{"$error":"#N/A"},{"$error":"#N/A"},{"$error":"#N/A"},{"$error":"#N/A"},{"$error":"#N/A"},{"$error":"#N/A"},{"$error":"#N/A"},{"$error":"#N/A"},{"$error":"#N/A"},{"$error":"#N/A"},{"$error":"#N/A"},{"$error":"#N/A"},{"$error":"#N/A"},{"$error":"#N/A"},{"$error":"#N/A"},{"$error":"#N/A"},{"$error":"#N/A"},{"$error":"#N/A"},{"$error":"#N/A"},{"$error":"#N/A"},{"$error":"#N/A"},{"$error":"#N/A"},{"$error":"#N/A"},{"$error":"#N/A"},{"$error":"#N/A"},{"$error":"#N/A"},{"$f":"AL116-AL117","v":{"$error":"#N/A"}},{"$error":"#N/A"},{"$error":"#N/A"},{"$error":"#N/A"},{"$error":"#N/A"},{"$error":"#N/A"},{"$error":"#N/A"},{"$error":"#N/A"},{"$error":"#N/A"},{"$error":"#N/A"},{"$error":"#N/A"},{"$error":"#N/A"},{"$error":"#N/A"},{"$error":"#N/A"},{"$error":"#N/A"},{"$error":"#N/A"},{"$error":"#N/A"},{"$error":"#N/A"},{"$error":"#N/A"},{"$error":"#N/A"},{"$error":"#N/A"},{"$error":"#N/A"},{"$error":"#N/A"},{"$error":"#N/A"},{"$error":"#N/A"},{"$error":"#N/A"},{"$error":"#N/A"},{"$error":"#N/A"},{"$error":"#N/A"},{"$error":"#N/A"},{"$error":"#N/A"},{"$error":"#N/A"},{"$f":"BR116-BR117","v":{"$error":"#N/A"}},{"$error":"#N/A"},{"$error":"#N/A"},{"$error":"#N/A"},{"$error":"#N/A"},{"$error":"#N/A"},{"$error":"#N/A"},{"$error":"#N/A"},{"$error":"#N/A"},{"$error":"#N/A"},{"$error":"#N/A"},{"$error":"#N/A"},{"$error":"#N/A"},{"$error":"#N/A"},{"$error":"#N/A"},{"$error":"#N/A"},{"$error":"#N/A"},{"$error":"#N/A"},{"$error":"#N/A"},{"$error":"#N/A"},{"$error":"#N/A"},{"$error":"#N/A"},{"$error":"#N/A"},{"$error":"#N/A"},{"$error":"#N/A"},{"$error":"#N/A"},{"$error":"#N/A"},{"$error":"#N/A"},{"$error":"#N/A"},{"$error":"#N/A"},{"$error":"#N/A"},{"$error":"#N/A"},{"$f":"CX116-CX117","v":{"$error":"#N/A"}},{"$f":"CY116-CY117","v":{"$error":"#N/A"}},{"$f":"CZ116-CZ117","v":{"$error":"#N/A"}},{"$f":"DA116-DA117","v":{"$error":"#N/A"}},{"$f":"DB116-DB117","v":{"$error":"#N/A"}},{"$error":"#N/A"}]
[{"$nulls":3},"Cactive",{"$f":"(E121-E120)","v":17.5},{"$f":"E119+F116-F117","v":{"$error":"#N/A"}},{"$error":"#N/A"},{"$error":"#N/A"},{"$error":"#N/A"},{"$error":"#N/A"},{"$error":"#N/A"},{"$error":"#N/A"},{"$error":"#N/A"},{"$error":"#N/A"},{"$error":"#N/A"},{"$error":"#N/A"},{"$error":"#N/A"},{"$error":"#N/A"},{"$error":"#N/A"},{"$error":"#N/A"},{"$error":"#N/A"},{"$error":"#N/A"},{"$error":"#N/A"},{"$error":"#N/A"},{"$error":"#N/A"},{"$error":"#N/A"},{"$error":"#N/A"},{"$error":"#N/A"},{"$error":"#N/A"},{"$error":"#N/A"},{"$error":"#N/A"},{"$error":"#N/A"},{"$error":"#N/A"},{"$error":"#N/A"},{"$error":"#N/A"},{"$error":"#N/A"},{"$error":"#N/A"},{"$f":"AK119+AL116-AL117","v":{"$error":"#N/A"}},{"$error":"#N/A"},{"$error":"#N/A"},{"$error":"#N/A"},{"$error":"#N/A"},{"$error":"#N/A"},{"$error":"#N/A"},{"$error":"#N/A"},{"$error":"#N/A"},{"$error":"#N/A"},{"$error":"#N/A"},{"$error":"#N/A"},{"$error":"#N/A"},{"$error":"#N/A"},{"$error":"#N/A"},{"$error":"#N/A"},{"$error":"#N/A"},{"$error":"#N/A"},{"$error":"#N/A"},{"$error":"#N/A"},{"$error":"#N/A"},{"$error":"#N/A"},{"$error":"#N/A"},{"$error":"#N/A"},{"$error":"#N/A"},{"$error":"#N/A"},{"$error":"#N/A"},{"$error":"#N/A"},{"$error":"#N/A"},{"$error":"#N/A"},{"$error":"#N/A"},{"$error":"#N/A"},{"$f":"BQ119+BR116-BR117","v":{"$error":"#N/A"}},{"$error":"#N/A"},{"$error":"#N/A"},{"$error":"#N/A"},{"$error":"#N/A"},{"$error":"#N/A"},{"$error":"#N/A"},{"$error":"#N/A"},{"$error":"#N/A"},{"$error":"#N/A"},{"$error":"#N/A"},{"$error":"#N/A"},{"$error":"#N/A"},{"$error":"#N/A"},{"$error":"#N/A"},{"$error":"#N/A"},{"$error":"#N/A"},{"$error":"#N/A"},{"$error":"#N/A"},{"$error":"#N/A"},{"$error":"#N/A"},{"$error":"#N/A"},{"$error":"#N/A"},{"$error":"#N/A"},{"$error":"#N/A"},{"$error":"#N/A"},{"$error":"#N/A"},{"$error":"#N/A"},{"$error":"#N/A"},{"$error":"#N/A"},{"$error":"#N/A"},{"$error":"#N/A"},{"$error":"#N/A"},{"$error":"#N/A"},{"$error":"#N/A"},{"$error":"#N/A"},{"$f":"DA119+DB116-DB117","v":{"$error":"#N/A"}},{"$f":"DB119+DC116-DC117","v":{"$error":"#N/A"}}]
[{"$nulls":3},"Cstable",{"$f":"E121*R148","v":32.5},{"$f":"E120","v":32.5},32.5,32.5,32.5,32.5,32.5,32.5,32.5,32.5,32.5,32.5,32.5,32.5,32.5,32.5,32.5,32.5,32.5,32.5,32.5,32.5,32.5,32.5,32.5,32.5,32.5,32.5,32.5,32.5,32.5,32.5,32.5,{"$f":"AK120","v":32.5},32.5,32.5,32.5,32.5,32.5,32.5,32.5,32.5,32.5,32.5,32.5,32.5,32.5,32.5,32.5,32.5,32.5,32.5,32.5,32.5,32.5,32.5,32.5,32.5,32.5,32.5,32.5,32.5,32.5,32.5,32.5,{"$f":"BQ120","v":32.5},32.5,32.5,32.5,32.5,32.5,32.5,32.5,32.5,32.5,32.5,32.5,32.5,32.5,32.5,32.5,32.5,32.5,32.5,32.5,32.5,32.5,32.5,32.5,32.5,32.5,32.5,32.5,32.5,32.5,32.5,32.5,32.5,32.5,32.5,32.5,{"$f":"DA120","v":32.5},{"$f":"DB120","v":32.5}]
[{"$nulls":3},"SOC total sans méthanisation",{"$f":"R147","v":50},{"$f":"F120+F119","v":{"$error":"#N/A"}},{"$error":"#N/A"},{"$error":"#N/A"},{"$error":"#N/A"},{"$error":"#N/A"},{"$error":"#N/A"},{"$error":"#N/A"},{"$error":"#N/A"},{"$error":"#N/A"},{"$error":"#N/A"},{"$error":"#N/A"},{"$error":"#N/A"},{"$error":"#N/A"},{"$error":"#N/A"},{"$error":"#N/A"},{"$error":"#N/A"},{"$error":"#N/A"},{"$error":"#N/A"},{"$error":"#N/A"},{"$error":"#N/A"},{"$error":"#N/A"},{"$error":"#N/A"},{"$error":"#N/A"},{"$error":"#N/A"},{"$error":"#N/A"},{"$error":"#N/A"},{"$error":"#N/A"},{"$error":"#N/A"},{"$error":"#N/A"},{"$error":"#N/A"},{"$error":"#N/A"},{"$error":"#N/A"},{"$f":"AL120+AL119","v":{"$error":"#N/A"}},{"$error":"#N/A"},{"$error":"#N/A"},{"$error":"#N/A"},{"$error":"#N/A"},{"$error":"#N/A"},{"$error":"#N/A"},{"$error":"#N/A"},{"$error":"#N/A"},{"$error":"#N/A"},{"$error":"#N/A"},{"$error":"#N/A"},{"$error":"#N/A"},{"$error":"#N/A"},{"$error":"#N/A"},{"$error":"#N/A"},{"$error":"#N/A"},{"$error":"#N/A"},{"$error":"#N/A"},{"$error":"#N/A"},{"$error":"#N/A"},{"$error":"#N/A"},{"$error":"#N/A"},{"$error":"#N/A"},{"$error":"#N/A"},{"$error":"#N/A"},{"$error":"#N/A"},{"$error":"#N/A"},{"$error":"#N/A"},{"$error":"#N/A"},{"$error":"#N/A"},{"$error":"#N/A"},{"$f":"BR120+BR119","v":{"$error":"#N/A"}},{"$error":"#N/A"},{"$error":"#N/A"},{"$error":"#N/A"},{"$error":"#N/A"},{"$error":"#N/A"},{"$error":"#N/A"},{"$error":"#N/A"},{"$error":"#N/A"},{"$error":"#N/A"},{"$error":"#N/A"},{"$error":"#N/A"},{"$error":"#N/A"},{"$error":"#N/A"},{"$error":"#N/A"},{"$error":"#N/A"},{"$error":"#N/A"},{"$error":"#N/A"},{"$error":"#N/A"},{"$error":"#N/A"},{"$error":"#N/A"},{"$error":"#N/A"},{"$error":"#N/A"},{"$error":"#N/A"},{"$error":"#N/A"},{"$error":"#N/A"},{"$error":"#N/A"},{"$error":"#N/A"},{"$error":"#N/A"},{"$error":"#N/A"},{"$error":"#N/A"},{"$error":"#N/A"},{"$f":"CX120+CX119","v":{"$error":"#N/A"}},{"$f":"CY120+CY119","v":{"$error":"#N/A"}},{"$f":"CZ120+CZ119","v":{"$error":"#N/A"}},{"$f":"DA120+DA119","v":{"$error":"#N/A"}},{"$f":"DB120+DB119","v":{"$error":"#N/A"}},{"$error":"#N/A"}]
[{"$nulls":4},"C hum apport avec métha",{"$f":"F100+F101+F105+F106+F109","v":0},0,0,0,0,0,0,0,0,0,0,0,0,0,0,0,0,0,0,0,0,0,0,0,0,0,0,0,0,0,0,0,{"$f":"AL100+AL101+AL105+AL106+AL109","v":0},0,0,0,0,0,0,0,0,0,0,0,0,0,0,0,0,0,0,0,0,0,0,0,0,0,0,0,0,0,0,0,{"$f":"BR100+BR101+BR105+BR106+BR109","v":0},0,0,0,0,0,0,0,0,0,0,0,0,0,0,0,0,0,0,0,0,0,0,0,0,0,0,0,0,0,0,0,0,0,0,0,{"$f":"DB100+DB101+DB105+DB106+DB109","v":0},0]
[{"$nulls":4},"Dégradation du C actif par rapport à l'année n-1",{"$f":"E125*$F$135","v":{"$error":"#N/A"}},{"$error":"#N/A"},{"$error":"#N/A"},{"$error":"#N/A"},{"$error":"#N/A"},{"$error":"#N/A"},{"$error":"#N/A"},{"$error":"#N/A"},{"$error":"#N/A"},{"$error":"#N/A"},{"$error":"#N/A"},{"$error":"#N/A"},{"$error":"#N/A"},{"$error":"#N/A"},{"$error":"#N/A"},{"$error":"#N/A"},{"$error":"#N/A"},{"$error":"#N/A"},{"$error":"#N/A"},{"$error":"#N/A"},{"$error":"#N/A"},{"$error":"#N/A"},{"$error":"#N/A"},{"$error":"#N/A"},{"$error":"#N/A"},{"$error":"#N/A"},{"$error":"#N/A"},{"$error":"#N/A"},{"$error":"#N/A"},{"$error":"#N/A"},{"$error":"#N/A"},{"$error":"#N/A"},{"$f":"AK125*$F$135","v":{"$error":"#N/A"}},{"$error":"#N/A"},{"$error":"#N/A"},{"$error":"#N/A"},{"$error":"#N/A"},{"$error":"#N/A"},{"$error":"#N/A"},{"$error":"#N/A"},{"$error":"#N/A"},{"$error":"#N/A"},{"$error":"#N/A"},{"$error":"#N/A"},{"$error":"#N/A"},{"$error":"#N/A"},{"$error":"#N/A"},{"$error":"#N/A"},{"$error":"#N/A"},{"$error":"#N/A"},{"$error":"#N/A"},{"$error":"#N/A"},{"$error":"#N/A"},{"$error":"#N/A"},{"$error":"#N/A"},{"$error":"#N/A"},{"$error":"#N/A"},{"$error":"#N/A"},{"$error":"#N/A"},{"$error":"#N/A"},{"$error":"#N/A"},{"$error":"#N/A"},{"$error":"#N/A"},{"$error":"#N/A"},{"$f":"BQ125*$F$135","v":{"$error":"#N/A"}},{"$error":"#N/A"},{"$error":"#N/A"},{"$error":"#N/A"},{"$error":"#N/A"},{"$error":"#N/A"},{"$error":"#N/A"},{"$error":"#N/A"},{"$error":"#N/A"},{"$error":"#N/A"},{"$error":"#N/A"},{"$error":"#N/A"},{"$error":"#N/A"},{"$error":"#N/A"},{"$error":"#N/A"},{"$error":"#N/A"},{"$error":"#N/A"},{"$error":"#N/A"},{"$error":"#N/A"},{"$error":"#N/A"},{"$error":"#N/A"},{"$error":"#N/A"},{"$error":"#N/A"},{"$error":"#N/A"},{"$error":"#N/A"},{"$error":"#N/A"},{"$error":"#N/A"},{"$error":"#N/A"},{"$error":"#N/A"},{"$error":"#N/A"},{"$error":"#N/A"},{"$error":"#N/A"},{"$error":"#N/A"},{"$error":"#N/A"},{"$error":"#N/A"},{"$error":"#N/A"},{"$f":"DA125*$F$135","v":{"$error":"#N/A"}},{"$f":"DB125*$F$135","v":{"$error":"#N/A"}}]
[{"$nulls":4},"Différence apport - dégradation",{"$f":"F122-F123","v":{"$error":"#N/A"}},{"$error":"#N/A"},{"$error":"#N/A"},{"$error":"#N/A"},{"$error":"#N/A"},{"$error":"#N/A"},{"$error":"#N/A"},{"$error":"#N/A"},{"$error":"#N/A"},{"$error":"#N/A"},{"$error":"#N/A"},{"$error":"#N/A"},{"$error":"#N/A"},{"$error":"#N/A"},{"$error":"#N/A"},{"$error":"#N/A"},{"$error":"#N/A"},{"$error":"#N/A"},{"$error":"#N/A"},{"$error":"#N/A"},{"$error":"#N/A"},{"$error":"#N/A"},{"$error":"#N/A"},{"$error":"#N/A"},{"$error":"#N/A"},{"$error":"#N/A"},{"$error":"#N/A"},{"$error":"#N/A"},{"$error":"#N/A"},{"$error":"#N/A"},{"$error":"#N/A"},{"$error":"#N/A"},{"$f":"AL122-AL123","v":{"$error":"#N/A"}},{"$error":"#N/A"},{"$error":"#N/A"},{"$error":"#N/A"},{"$error":"#N/A"},{"$error":"#N/A"},{"$error":"#N/A"},{"$error":"#N/A"},{"$error":"#N/A"},{"$error":"#N/A"},{"$error":"#N/A"},{"$error":"#N/A"},{"$error":"#N/A"},{"$error":"#N/A"},{"$error":"#N/A"},{"$error":"#N/A"},{"$error":"#N/A"},{"$error":"#N/A"},{"$error":"#N/A"},{"$error":"#N/A"},{"$error":"#N/A"},{"$error":"#N/A"},{"$error":"#N/A"},{"$error":"#N/A"},{"$error":"#N/A"},{"$error":"#N/A"},{"$error":"#N/A"},{"$error":"#N/A"},{"$error":"#N/A"},{"$error":"#N/A"},{"$error":"#N/A"},{"$error":"#N/A"},{"$f":"BR122-BR123","v":{"$error":"#N/A"}},{"$error":"#N/A"},{"$error":"#N/A"},{"$error":"#N/A"},{"$error":"#N/A"},{"$error":"#N/A"},{"$error":"#N/A"},{"$error":"#N/A"},{"$error":"#N/A"},{"$error":"#N/A"},{"$error":"#N/A"},{"$error":"#N/A"},{"$error":"#N/A"},{"$error":"#N/A"},{"$error":"#N/A"},{"$error":"#N/A"},{"$error":"#N/A"},{"$error":"#N/A"},{"$error":"#N/A"},{"$error":"#N/A"},{"$error":"#N/A"},{"$error":"#N/A"},{"$error":"#N/A"},{"$error":"#N/A"},{"$error":"#N/A"},{"$error":"#N/A"},{"$error":"#N/A"},{"$error":"#N/A"},{"$error":"#N/A"},{"$error":"#N/A"},{"$error":"#N/A"},{"$error":"#N/A"},{"$f":"CX122-CX123","v":{"$error":"#N/A"}},{"$f":"CY122-CY123","v":{"$error":"#N/A"}},{"$f":"CZ122-CZ123","v":{"$error":"#N/A"}},{"$f":"DA122-DA123","v":{"$error":"#N/A"}},{"$f":"DB122-DB123","v":{"$error":"#N/A"}},{"$error":"#N/A"}]
[{"$nulls":3},"Cactive",{"$f":"E127-E126","v":17.5},{"$f":"E125+F122-F123","v":{"$error":"#N/A"}},{"$error":"#N/A"},{"$error":"#N/A"},{"$error":"#N/A"},{"$error":"#N/A"},{"$error":"#N/A"},{"$error":"#N/A"},{"$error":"#N/A"},{"$error":"#N/A"},{"$error":"#N/A"},{"$error":"#N/A"},{"$error":"#N/A"},{"$error":"#N/A"},{"$error":"#N/A"},{"$error":"#N/A"},{"$error":"#N/A"},{"$error":"#N/A"},{"$error":"#N/A"},{"$error":"#N/A"},{"$error":"#N/A"},{"$error":"#N/A"},{"$error":"#N/A"},{"$error":"#N/A"},{"$error":"#N/A"},{"$error":"#N/A"},{"$error":"#N/A"},{"$error":"#N/A"},{"$error":"#N/A"},{"$error":"#N/A"},{"$error":"#N/A"},{"$error":"#N/A"},{"$error":"#N/A"},{"$f":"AK125+AL122-AL123","v":{"$error":"#N/A"}},{"$error":"#N/A"},{"$error":"#N/A"},{"$error":"#N/A"},{"$error":"#N/A"},{"$error":"#N/A"},{"$error":"#N/A"},{"$error":"#N/A"},{"$error":"#N/A"},{"$error":"#N/A"},{"$error":"#N/A"},{"$error":"#N/A"},{"$error":"#N/A"},{"$error":"#N/A"},{"$error":"#N/A"},{"$error":"#N/A"},{"$error":"#N/A"},{"$error":"#N/A"},{"$error":"#N/A"},{"$error":"#N/A"},{"$error":"#N/A"},{"$error":"#N/A"},{"$error":"#N/A"},{"$error":"#N/A"},{"$error":"#N/A"},{"$error":"#N/A"},{"$error":"#N/A"},{"$error":"#N/A"},{"$error":"#N/A"},{"$error":"#N/A"},{"$error":"#N/A"},{"$error":"#N/A"},{"$f":"BQ125+BR122-BR123","v":{"$error":"#N/A"}},{"$error":"#N/A"},{"$error":"#N/A"},{"$error":"#N/A"},{"$error":"#N/A"},{"$error":"#N/A"},{"$error":"#N/A"},{"$error":"#N/A"},{"$error":"#N/A"},{"$error":"#N/A"},{"$error":"#N/A"},{"$error":"#N/A"},{"$error":"#N/A"},{"$error":"#N/A"},{"$error":"#N/A"},{"$error":"#N/A"},{"$error":"#N/A"},{"$error":"#N/A"},{"$error":"#N/A"},{"$error":"#N/A"},{"$error":"#N/A"},{"$error":"#N/A"},{"$error":"#N/A"},{"$error":"#N/A"},{"$error":"#N/A"},{"$error":"#N/A"},{"$error":"#N/A"},{"$error":"#N/A"},{"$error":"#N/A"},{"$error":"#N/A"},{"$error":"#N/A"},{"$error":"#N/A"},{"$error":"#N/A"},{"$error":"#N/A"},{"$error":"#N/A"},{"$error":"#N/A"},{"$f":"DA125+DB122-DB123","v":{"$error":"#N/A"}},{"$f":"DB125+DC122-DC123","v":{"$error":"#N/A"}}]
[{"$nulls":3},"Cstable",{"$f":"E127*R148","v":32.5},{"$f":"E126","v":32.5},32.5,32.5,32.5,32.5,32.5,32.5,32.5,32.5,32.5,32.5,32.5,32.5,32.5,32.5,32.5,32.5,32.5,32.5,32.5,32.5,32.5,32.5,32.5,32.5,32.5,32.5,32.5,32.5,32.5,32.5,32.5,{"$f":"AK126","v":32.5},32.5,32.5,32.5,32.5,32.5,32.5,32.5,32.5,32.5,32.5,32.5,32.5,32.5,32.5,32.5,32.5,32.5,32.5,32.5,32.5,32.5,32.5,32.5,32.5,32.5,32.5,32.5,32.5,32.5,32.5,32.5,{"$f":"BQ126","v":32.5},32.5,32.5,32.5,32.5,32.5,32.5,32.5,32.5,32.5,32.5,32.5,32.5,32.5,32.5,32.5,32.5,32.5,32.5,32.5,32.5,32.5,32.5,32.5,32.5,32.5,32.5,32.5,32.5,32.5,32.5,32.5,32.5,32.5,32.5,32.5,{"$f":"DA126","v":32.5},{"$f":"DB126","v":32.5}]
[{"$nulls":3},"SOC total avec méthanisation",{"$f":"E121","v":50},{"$f":"F126+F125","v":{"$error":"#N/A"}},{"$error":"#N/A"},{"$error":"#N/A"},{"$error":"#N/A"},{"$error":"#N/A"},{"$error":"#N/A"},{"$error":"#N/A"},{"$error":"#N/A"},{"$error":"#N/A"},{"$error":"#N/A"},{"$error":"#N/A"},{"$error":"#N/A"},{"$error":"#N/A"},{"$error":"#N/A"},{"$error":"#N/A"},{"$error":"#N/A"},{"$error":"#N/A"},{"$error":"#N/A"},{"$error":"#N/A"},{"$error":"#N/A"},{"$error":"#N/A"},{"$error":"#N/A"},{"$error":"#N/A"},{"$error":"#N/A"},{"$error":"#N/A"},{"$error":"#N/A"},{"$error":"#N/A"},{"$error":"#N/A"},{"$error":"#N/A"},{"$error":"#N/A"},{"$error":"#N/A"},{"$error":"#N/A"},{"$f":"AL126+AL125","v":{"$error":"#N/A"}},{"$error":"#N/A"},{"$error":"#N/A"},{"$error":"#N/A"},{"$error":"#N/A"},{"$error":"#N/A"},{"$error":"#N/A"},{"$error":"#N/A"},{"$error":"#N/A"},{"$error":"#N/A"},{"$error":"#N/A"},{"$error":"#N/A"},{"$error":"#N/A"},{"$error":"#N/A"},{"$error":"#N/A"},{"$error":"#N/A"},{"$error":"#N/A"},{"$error":"#N/A"},{"$error":"#N/A"},{"$error":"#N/A"},{"$error":"#N/A"},{"$error":"#N/A"},{"$error":"#N/A"},{"$error":"#N/A"},{"$error":"#N/A"},{"$error":"#N/A"},{"$error":"#N/A"},{"$error":"#N/A"},{"$error":"#N/A"},{"$error":"#N/A"},{"$error":"#N/A"},{"$error":"#N/A"},{"$f":"BR126+BR125","v":{"$error":"#N/A"}},{"$error":"#N/A"},{"$error":"#N/A"},{"$error":"#N/A"},{"$error":"#N/A"},{"$error":"#N/A"},{"$error":"#N/A"},{"$error":"#N/A"},{"$error":"#N/A"},{"$error":"#N/A"},{"$error":"#N/A"},{"$error":"#N/A"},{"$error":"#N/A"},{"$error":"#N/A"},{"$error":"#N/A"},{"$error":"#N/A"},{"$error":"#N/A"},{"$error":"#N/A"},{"$error":"#N/A"},{"$error":"#N/A"},{"$error":"#N/A"},{"$error":"#N/A"},{"$error":"#N/A"},{"$error":"#N/A"},{"$error":"#N/A"},{"$error":"#N/A"},{"$error":"#N/A"},{"$error":"#N/A"},{"$error":"#N/A"},{"$error":"#N/A"},{"$error":"#N/A"},{"$error":"#N/A"},{"$f":"CX126+CX125","v":{"$error":"#N/A"}},{"$f":"CY126+CY125","v":{"$error":"#N/A"}},{"$f":"CZ126+CZ125","v":{"$error":"#N/A"}},{"$f":"DA126+DA125","v":{"$error":"#N/A"}},{"$f":"DB126+DB125","v":{"$error":"#N/A"}},{"$error":"#N/A"}]
[]
[null,"SOC stocks increase",{"$nulls":3},"Variation du SOC\nt C / ha / an","Variation du SOC\nkg C / ha / an","Equivalence CO2\nkg CO2 / ha / an"]
[null,"à horizon 20 ans",{"$nulls":3},{"$f":"(AVERAGE(W127:AA127)-AVERAGE(W121:AA121))/R142","v":{"$error":"#N/A"}},{"$f":"F130*1000","v":{"$error":"#N/A"}},{"$f":"G130/12*44","v":{"$error":"#N/A"}},{"$f":"F130/E121*1000","v":{"$error":"#N/A"}},"relatif pour 1000 par an"]
[null,"à horizon 30 ans",{"$nulls":3},{"$f":"(AVERAGE(AG127:AK127)-AVERAGE(AG121:AK121))/R143","v":{"$error":"#N/A"}},{"$f":"F131*1000","v":{"$error":"#N/A"}},{"$f":"G131/12*44","v":{"$error":"#N/A"}},{"$f":"F131/E121*1000","v":{"$error":"#N/A"}},"relatif pour 1000 par an"]
[null,"à horizon 100 ans",{"$nulls":3},{"$f":"(AVERAGE(CY127:DC127)-AVERAGE(CY121:DC121))/R144","v":{"$error":"#N/A"}},{"$f":"F132*1000","v":{"$error":"#N/A"}},{"$f":"G132/12*44","v":{"$error":"#N/A"}},{"$f":"F132/E121*1000","v":{"$error":"#N/A"}},"relatif pour 1000 par an"]
[]
[null,"Fonctions de l'environnements et paramètres",null,null,"k0",0.29]
[{"$nulls":4},"k",{"$f":"F134*F139*F148*F156*F162*F168*F175","v":{"$error":"#N/A"}},null,null,"Plus k est grand, plus la dégradation est grande, plus SOC diminue rapidement"]
[]
[]
[]
[{"$nulls":4},"f(T)",{"$f":"F143/(1+F144*EXP(-F145*F142))","v":0.1710085285787164},{"$nulls":10},"Cas numéro",1]
[{"$nulls":16},"Réduction du rendement de la culture suivante",4,"% par t MS/ha/an au dessus de 5tMS/ha/an"]
[{"$nulls":17},"évalutation "]
[{"$nulls":4},"T",{"$f":"X163","v":0},{"$nulls":10},"Nombre d'année",20,"ans",{"$nulls":8},"6 et 8 : pas assez de stockage"]
[{"$nulls":4},"aT",25,{"$nulls":10},"Nombre d'année",30,"ans",{"$nulls":8},"13 : un peu trop de stockage"]
[{"$nulls":4},"bT",{"$f":"(F143-1)*EXP(F145*F146)","v":145.19153914591067},{"$nulls":10},"Nombre d'année",100,"ans"]
[{"$nulls":4},"cT",0.12]
[{"$nulls":4},"Tref",15,{"$nulls":10},"Depth",25,"modifiable ?"]
[{"$nulls":16},"Ctot initial",50,"tC/ha"]
[{"$nulls":4},"f(H)",{"$f":"1/(1+F153*EXP(-F154*(F150+F152-F151)/1000))","v":0.970873786407767},{"$nulls":10},"% C stable",0.65]
[]
[{"$nulls":4},"P",{"$f":"Y163","v":0}]
[{"$nulls":4},"PET",{"$f":"Z163","v":0}]
[{"$nulls":4},"IW (irrigation water)",{"$f":"AA163","v":0}]
[{"$nulls":4},"aH",0.03]
[{"$nulls":4},"bH",5.247]
[{"$nulls":16},"Typically,  an  energy  cover  crop  yield  of  7  t  DM  ha−1  (with  20%  DM  content)  corresponded  approximately  to  a  digestate  application  of  35  m3  ha−1  once  in  the  rotation"]
[{"$nulls":4},"f(A)",{"$f":"EXP(-F159*F158/100*1000)","v":{"$error":"#N/A"}}]
[{"$nulls":21},"Si plusieurs CIVE dans une rotation ?"]
[{"$nulls":4},"A",{"$f":"T163","v":{"$error":"#N/A"}},"%",{"$nulls":20},"Moutarde par défaut --> CIMS ? Rendement plus élevé ?"]
[{"$nulls":4},2,2.519E-3,"g/kg",{"$nulls":9},"Cas",2,null,"Culture suivant la CIVE","Rendement (t DM/ha/an)","Année de la CIVE et de la culture suivante dans la rotation","Durée totale de la rotation en année",null,null,"Type de CIVE","Rendement de la CIVE (t DM/ha/an)","Sans méthanitasion","Rendement de la CIVE (t DM/ha/an)"]
[{"$nulls":19},{"$f":"VLOOKUP($R$159,$E$185:$X$693,19,FALSE)","v":{"$error":"#N/A"}},{"$f":"VLOOKUP($R$159,$E$185:$X$693,20,FALSE)","v":0},{"$f":"VLOOKUP($R$159,$E$185:$X$693,15,FALSE)","v":0},{"$f":"VLOOKUP($R$159,$E$185:$X$693,16,FALSE)","v":0},null,null,{"$f":"VLOOKUP($R$159,$E$185:$X$693,13,FALSE)","v":0},{"$f":"VLOOKUP($R$159,$E$185:$X$693,14,FALSE)","v":0},{"$f":"VLOOKUP($R$159,$E$185:$X$693,11,FALSE)","v":""},{"$f":"VLOOKUP($R$159,$E$185:$X$693,12,FALSE)","v":""}]
[]
[{"$nulls":4},"f(CaCO3)",{"$f":"1/(1+F165*F164/100*1000)","v":{"$error":"#N/A"}},null,"j'ai multiplié par *0,21 pour cas 6 et c'est ok. Mais pas pour les autres cas…",{"$nulls":11},"Clay (%)","CaCO3 (%)","pH","C:N","T","Rainfall (mm)","PET (mm)","IW (total irrigation water over the rotation)"]
[{"$nulls":19},{"$f":"VLOOKUP($R$159,$E$185:$M$693,3,FALSE)","v":{"$error":"#N/A"}},{"$f":"VLOOKUP($R$159,$E$185:$M$693,4,FALSE)","v":{"$error":"#N/A"}},{"$f":"VLOOKUP($R$159,$E$185:$M$693,5,FALSE)","v":0},{"$f":"VLOOKUP($R$159,$E$185:$M$693,6,FALSE)","v":{"$error":"#N/A"}},{"$f":"VLOOKUP($R$159,$E$185:$M$693,7,FALSE)","v":0},{"$f":"VLOOKUP($R$159,$E$185:$M$693,8,FALSE)","v":0},{"$f":"VLOOKUP($R$159,$E$185:$M$693,9,FALSE)","v":0},{"$f":"VLOOKUP($R$159,$E185:$N$693,10,FALSE)","v":0}]
[{"$nulls":4},"CaCO3",{"$f":"U163","v":{"$error":"#N/A"}},"%"]
[{"$nulls":4},"cm",1.5E-3,"g/kg"]
[]
[]
[{"$nulls":4},"f(pH)",{"$f":"EXP(-F172*(F171-F173)*(F171-F173))","v":3.0597719038980942E-4},{"$nulls":13},"HI harvest index","SRR shoot:root  ratio","beta (a crop-specific  parameter related to root  distributions)","Hag humification   coefficient   of   aboveground   residues","Hbg the   humification   coefficient   of belowground residues is equal to 0.4 for all crops",{"$nulls":3},"Table S2 Soil characteristics of the first layer (0-25 cm) used in AMG for the different case study"]
[{"$nulls":16},"Blé d'hiver","Winter wheat","Primary crop",0.49,6.84,0.96,0.22,0.4,{"$nulls":3},"Type de sol","Clay (%)","CaCO3 (%)","pH","C:N"]
[{"$nulls":16},"Orge d'hiver","Winter barley","Primary crop",0.51,9.45,0.94,0.22,0.4,{"$nulls":3},"Sable limoneux",9,0.5,null,10]
[{"$nulls":4},"pH",{"$f":"V163","v":0},{"$nulls":10},"Colza","Rapeseed","Primary crop",0.25,4.9,0.92,0.23,0.4,{"$nulls":3},"Sable crayeux",10,25,null,10]
[{"$nulls":4},"apH",0.112,{"$nulls":10},"Betterave","Sugar beet","Primary crop",0.78,55.97,0.95,0.32,0.4,{"$nulls":3},"Limon sableux",14,0.5,null,10]
[{"$nulls":4},"bpH",8.5,{"$nulls":10},"Soja","Soybean","Primary crop",0.32,5.19,0.94,0.28,0.4,{"$nulls":3},"Limon moyen",16.5,0.5,null,10]
[{"$nulls":16},"Maïs grain","Grain maize","Primary crop",0.54,5.6,0.95,0.23,0.4,{"$nulls":3},"Limon argileux",22.5,0.5,null,10]
[{"$nulls":4},"f(C/N)",{"$f":"0.8*EXP(-F178*(F177-F179)*(F177-F179))+0.2","v":{"$error":"#N/A"}},{"$nulls":10},"Tournesol","Sunflower","Primary crop",0.33,5.66,0.93,0.25,0.4,{"$nulls":3},"Argile sableuse",30,0.5,null,10]
[{"$nulls":16},"Moutarde blanche","Mustard","Primary crop",0,5.66,0.93,0.31,0.4,{"$nulls":3},"Argile limoneuse",35,0.5,null,10]
[{"$nulls":4},"C/N",{"$f":"W163","v":{"$error":"#N/A"}},{"$nulls":9}," (ensilage céréal immature)","CIVE d'hiver","Silage winter cereals","Winter energy cover crop",0.9,6,0.94,0.31,0.4,{"$nulls":3},"Argile lourde",40,0.5,null,10]
[{"$nulls":4},"aCN",0.06,{"$nulls":9}," (ensilage de maïs)","CIVE d'été","Silage maize","Summer energy cover crop",0.9,5.6,0.95,0.23,0.4,{"$nulls":3},"Cranette",11,60,null,10]
[{"$nulls":4},"bCN",11,{"$nulls":10},"Culture dédiée",{"$nulls":10},"Limon crayeux",13.5,45,null,10]
[{"$nulls":16},"CIPAN",{"$nulls":10},"Argilo-calcaire",32,40,null,10]
[{"$nulls":16},"Sol nu"]
[]
[{"$nulls":5},"Table S2 Soil characteristics of the first layer (0-25 cm) used in AMG for the different case study",{"$nulls":4},"Table S1: Climate characteristics of thecase studiesfor the reference period (1981-2010)",{"$nulls":3},"Production agricole",{"$nulls":11},"Estimation du stockage potentiel "]
[null,"https://www6.hautsdefrance.inrae.fr/agroimpact/Nos-dispositifs-outils/Modeles-et-outils-d-aide-a-la-decision/AMG-et-SIMEOS-AMG/AMG-model-description",null,"Substrat CIVE numéro","Numéro du cas CIVE (pour l'incrémentation)","Type","Clay (%)","CaCO3 (%)","pH","C:N","Temperature (°C)","Rainfall (mm)","PET (mm)","Irrigation (mm)","Sans métha CC","t DM / ha","Avec métha CC","Rendement CIVE t DM / ha","Place de la culture suivant la CC","Nombre de culture","Nombre d'insertion de CC sur 30 ans","Cultures principaless suivantes","Primary crop following the CC","Crop grain (or root for sugarbeet) yields (tDMha-1) of the primarycrops used in AMG ","Nombre d'insertion de CC sur 100 ans",null,"tC / ha / an à 20 ans","kg CO2 eq / ha / an à 20 ans","tC / ha / an à 30 ans","kg CO2 eq / ha / an à 30 ans","tC / ha / an à 100 ans","kg CO2 eq / ha / an à 100 ans"]
[null,"https://www6.hautsdefrance.inrae.fr/agroimpact/content/download/3760/36367/version/1/file/AMG_detailed_model_description.pdf",null,"Substrat 4",1,{"$f":"_xlfn.XLOOKUP(D185,'Description des substrats'!$D$20:$D$22,'Description des substrats'!$J$20:$J$22,0)","v":0},{"$f":"VLOOKUP(F185,$AB$170:$AF$180,2,FALSE)","v":{"$error":"#N/A"}},{"$f":"VLOOKUP(F185,$AB$170:$AF$180,3,FALSE)","v":{"$error":"#N/A"}},{"$f":"_xlfn.XLOOKUP(D185,'Description des substrats'!$D$20:$D$22,'Description des substrats'!$K$20:$K$22,0)","v":0},{"$f":"VLOOKUP(F185,$AB$170:$AF$180,5,FALSE)","v":{"$error":"#N/A"}},{"$f":"_xlfn.XLOOKUP(D185,'Description des substrats'!$D$20:$D$22,'Description des substrats'!$L$20:$L$22,0)","v":0},{"$f":"_xlfn.XLOOKUP(D185,'Description des substrats'!$D$20:$D$22,'Description des substrats'!$M$20:$M$22,0)","v":0},{"$f":"_xlfn.XLOOKUP(D185,'Description des substrats'!$D$20:$D$22,'Description des substrats'!$N$20:$N$22,0)","v":0},{"$f":"_xlfn.XLOOKUP(D185,'Description des substrats'!$D$20:$D$22,'Description des substrats'!$O$20:$O$22,0)","v":0},{"$f":"IF(_xlfn.XLOOKUP(D185,'Description des substrats'!$D$20:$D$22,'Description des substrats'!$I$20:$I$22,0)=\"CIPAN\",\"Mustard\",\"\")","v":""},{"$f":"IF(O185=\"Mustard\",2,\"\")","v":""},{"$f":"_xlfn.XLOOKUP(D185,'Données projet substrat'!$B$6:$B$306, 'Données projet substrat'!$D$6:$D$306,0)","v":0},{"$f":"_xlfn.XLOOKUP(D185,'Description des substrats'!$D$17:$D$20,'Description des substrats'!$G$17:$G$20,0)","v":0},{"$f":"_xlfn.XLOOKUP(D185,'Description des substrats'!$D$20:$D$22,'Description des substrats'!$Q$20:$Q$22,0)","v":0},{"$f":"_xlfn.XLOOKUP(D185,'Description des substrats'!$D$20:$D$22,'Description des substrats'!$P$20:$P$22,0)","v":0},{"$f":"30/T185","v":{"$error":"#DIV/0!"}},{"$f":"_xlfn.XLOOKUP(D185,'Description des substrats'!$D$20:$D$22,'Description des substrats'!$R$20:$R$22,0)","v":0},{"$f":"VLOOKUP(V185,$Q$168:$R$174,2,FALSE)","v":{"$error":"#N/A"}},{"$f":"_xlfn.XLOOKUP(D185,'Description des substrats'!$D$20:$D$22,'Description des substrats'!$S$20:$S$22,0)","v":0},{"$f":"100/T185","v":{"$error":"#DIV/0!"}},null,0,{"$f":"IFERROR(-AA185/12*44*1000,0)","v":0},0,{"$f":"IFERROR(-AC185/12*44*1000,0)","v":0},0,{"$f":"IFERROR(-AE185/12*44*1000,0)","v":0},{"$f":"IFERROR(-AF185/12*44*1000,0)","v":0}]
[null,"https://www6.hautsdefrance.inrae.fr/agroimpact/content/download/3760/36367/version/1/file/AMG_detailed_model_description.pdf",null,"Substrat 5",2,{"$f":"_xlfn.XLOOKUP(D186,'Description des substrats'!$D$20:$D$22,'Description des substrats'!$J$20:$J$22,0)","v":0},{"$f":"VLOOKUP(F186,$AB$170:$AF$180,2,FALSE)","v":{"$error":"#N/A"}},{"$f":"VLOOKUP(F186,$AB$170:$AF$180,3,FALSE)","v":{"$error":"#N/A"}},{"$f":"_xlfn.XLOOKUP(D186,'Description des substrats'!$D$20:$D$22,'Description des substrats'!$K$20:$K$22,0)","v":0},{"$f":"VLOOKUP(F186,$AB$170:$AF$180,5,FALSE)","v":{"$error":"#N/A"}},{"$f":"_xlfn.XLOOKUP(D186,'Description des substrats'!$D$20:$D$22,'Description des substrats'!$L$20:$L$22,0)","v":0},{"$f":"_xlfn.XLOOKUP(D186,'Description des substrats'!$D$20:$D$22,'Description des substrats'!$M$20:$M$22,0)","v":0},{"$f":"_xlfn.XLOOKUP(D186,'Description des substrats'!$D$20:$D$22,'Description des substrats'!$N$20:$N$22,0)","v":0},{"$f":"_xlfn.XLOOKUP(D186,'Description des substrats'!$D$20:$D$22,'Description des substrats'!$O$20:$O$22,0)","v":0},{"$f":"IF(_xlfn.XLOOKUP(D186,'Description des substrats'!$D$20:$D$22,'Description des substrats'!$I$20:$I$22,0)=\"CIPAN\",\"Mustard\",\"\")","v":""},{"$f":"IF(O186=\"Mustard\",2,\"\")","v":""},{"$f":"_xlfn.XLOOKUP(D186,'Données projet substrat'!$B$6:$B$305, 'Données projet substrat'!$D$6:$D$305,0)","v":0},{"$f":"_xlfn.XLOOKUP(D186,'Description des substrats'!$D$17:$D$20,'Description des substrats'!$G$17:$G$20,0)","v":0},{"$f":"_xlfn.XLOOKUP(D186,'Description des substrats'!$D$20:$D$22,'Description des substrats'!$Q$20:$Q$22,0)","v":0},{"$f":"_xlfn.XLOOKUP(D186,'Description des substrats'!$D$20:$D$22,'Description des substrats'!$P$20:$P$22,0)","v":0},{"$f":"30/T186","v":{"$error":"#DIV/0!"}},{"$f":"_xlfn.XLOOKUP(D186,'Description des substrats'!$D$20:$D$22,'Description des substrats'!$R$20:$R$22,0)","v":0},{"$f":"VLOOKUP(V186,$Q$168:$R$174,2,FALSE)","v":{"$error":"#N/A"}},{"$f":"_xlfn.XLOOKUP(D186,'Description des substrats'!$D$20:$D$22,'Description des substrats'!$S$20:$S$22,0)","v":0},{"$f":"100/T186","v":{"$error":"#DIV/0!"}},null,0,{"$f":"IFERROR(-AA186/12*44*1000,0)","v":0},0,{"$f":"IFERROR(-AC186/12*44*1000,0)","v":0},0,{"$f":"IFERROR(-AE186/12*44*1000,0)","v":0},{"$f":"IFERROR(-AF186/12*44*1000,0)","v":0}]

{"sheet":"Calculs fonctionnement","index":13,"n_rows":335,"n_cols":28,"rows_kept":335,"hidden":true,"merged":[[169,0,169,8],[170,1,170,4],[170,5,170,8],[203,1,203,10],[203,11,203,12],[216,0,216,2],[225,3,228,3]]}
["Calculs de fonctionnement"]
[]
["1. Caractérisation du mélange de substrat/ du digestat",{"$nulls":7},"si séparation"]
[null,"Entrée Digesteur","Teneur Entrée Digesteur (kg/t MB)","Sortie Digesteur (brut)","Teneur Sortie Digesteur (kg/t MB)","Evolution de la composition en absolue","Taux de capture en phase solide","Part du digestat brut non séparé (avant recirculation)","Envoi digestat brut en séparation","Digestat phase liquide avant recirculation","Phase liquide recirculée","Entrée stockage digestat brut avec recirculation","Entrée stockage digestat phase liquide","Entrée stockage digestat phase solide",null,"Sortie stockage digestat phase brut pour épandage","Sortie stockage digestat phase liquide pour épandage","Sortie stockage digestat phase solide pour épandage",null,null,"Epandage digestat phase brut","Epandage digestat phase liquide","Epandage digestat phase solide",null,"Mineral Fertilizer Equivalent","Digestat épandu phase brut","Digestat épandu phase liquide","Digestat épandu phase solide"]
["MB (t)",{"$f":"'Données projet substrat'!G4","v":{"v":0,"d":"0.0"}},"/",{"$f":"'Données projet substrat'!BA4","v":{"v":0,"d":"0.00"}},"/",{"$f":"(D5-B5)/B5","v":{"$error":"#DIV/0!"}},{"$f":"IF('Données projet'!B87=\"centrifugeuse\",'BDD modélisation ICV'!B82,IF('Données projet'!B87=\"presse à vis\",'BDD modélisation ICV'!C82,0))","v":{"v":0,"d":"0%"}},{"$f":"D5*(1-'Données projet'!B$88)","v":{"v":0,"d":"0.00"}},{"$f":"IF(G5=0,0,D5-H5)","v":{"v":0,"d":"0.00"}},{"$f":"IF(G5=0,0,((1-G5)*I5))","v":{"v":0,"d":"0.00"}},{"$f":"IF(G5=0,0,J5*'Données projet'!$B$89)","v":{"v":0,"d":"0.00"}},{"$f":"IF(G5=0,H5,H5+K5)","v":{"v":0,"d":"0.00"}},{"$f":"IF(G5=0,0,J5-K5)","v":{"v":0,"d":"0.00"}},{"$f":"IF(G5=0,0,(G5*I5))","v":{"v":0,"d":"0.00"}},"MB (t)",{"$f":"L5-(L6-P6)","v":{"v":0,"d":"0.00"}},{"$f":"M5-(M6-Q6)","v":{"v":0,"d":"0.00"}},{"$f":"N5-(N6-R6)","v":{"v":0,"d":"0.00"}},null,"Ntot (kg)",{"$f":"P8","v":{"v":0,"d":"0.00"}},{"$f":"Q8","v":{"v":0,"d":"0.00"}},{"v":0,"d":"0.00"}]
["MS (t)",{"$f":"'Données projet substrat'!V4","v":{"v":0,"d":"0.0"}},{"$f":"B6*1000/$B$5","v":{"$error":"#DIV/0!"}},{"$f":"'Données projet substrat'!W4","v":{"v":0,"d":"0.00"}},{"$f":"D6*1000/$D$5","v":{"$error":"#DIV/0!"}},{"$f":"(D6-B6)/B6","v":{"$error":"#DIV/0!"}},{"$f":"IF('Données projet'!B87=\"centrifugeuse\",'BDD modélisation ICV'!B83,IF('Données projet'!B87=\"presse à vis\",'BDD modélisation ICV'!C83,0))","v":{"v":0,"d":"0%"}},{"$f":"D6*(1-'Données projet'!B$88)","v":{"v":0,"d":"0.00"}},{"$f":"IF(G6=0,0,D6-H6)","v":{"v":0,"d":"0.00"}},{"$f":"IF(G6=0,0,((1-G6)*I6))","v":{"v":0,"d":"0.00"}},{"$f":"IF(G6=0,0,J6*'Données projet'!$B$89)","v":{"v":0,"d":"0.00"}},{"$f":"IF(G6=0,H6,H6+K6)","v":{"v":0,"d":"0.00"}},{"$f":"IF(G6=0,0,J6-K6)","v":{"v":0,"d":"0.00"}},{"$f":"IF(G6=0,0,(G6*I6))","v":{"v":0,"d":"0.00"}},"MS (t)",{"$f":"L6*(1-'BDD modélisation ICV'!B93)","v":0},{"$f":"M6*(1-'BDD modélisation ICV'!C93)","v":0},{"$f":"N6*(1-'BDD modélisation ICV'!D93)","v":0},null,"NH4+ (kg)",0,0,0,null,"N-NH4+ (kg)",{"$f":"U6/18*14","v":0},{"$f":"V6/18*14","v":0},{"$f":"W6/18*14","v":0}]
["MO (t)",{"$f":"'Données projet substrat'!X4","v":{"v":0,"d":"0.0"}},{"$f":"B7*1000/$B$5","v":{"$error":"#DIV/0!"}},{"$f":"'Données projet substrat'!Y4","v":{"v":0,"d":"0.00"}},{"$f":"D7*1000/$D$5","v":{"$error":"#DIV/0!"}},{"$f":"(D7-B7)/B7","v":{"$error":"#DIV/0!"}},{"$f":"IF('Données projet'!B87=\"centrifugeuse\",'BDD modélisation ICV'!B84,IF('Données projet'!B87=\"presse à vis\",'BDD modélisation ICV'!C84,0))","v":{"v":0,"d":"0%"}},{"$f":"D7*(1-'Données projet'!B$88)","v":{"v":0,"d":"0.00"}},{"v":0,"d":"0.00"},{"v":0,"d":"0.00"},{"$f":"IF(G7=0,0,J7*'Données projet'!$B$89)","v":{"v":0,"d":"0.00"}},{"$f":"IF(G7=0,H7,H7+K7)","v":{"v":0,"d":"0.00"}},{"v":0,"d":"0.00"},{"v":0,"d":"0.00"},"MO (t)",{"$f":"L7*(1-'BDD modélisation ICV'!B94)","v":0},{"$f":"M7*(1-'BDD modélisation ICV'!C94)","v":0},{"$f":"N7*(1-'BDD modélisation ICV'!D94)","v":0},null,"Norg (kg)",0,0,0,null,"Norg-mineralisé (kg)",{"$f":"U7*'BDD modélisation ICV'!B126","v":{"v":0,"d":"0.00"}},{"$f":"V7*'BDD modélisation ICV'!C126","v":{"v":0,"d":"0.00"}},{"$f":"W7*'BDD modélisation ICV'!D126","v":{"v":0,"d":"0.00"}}]
["Ntot (kg)",{"$f":"'Données projet substrat'!AR4","v":{"v":0,"d":"0.0"}},{"$f":"B8/$B$5","v":{"$error":"#DIV/0!"}},{"$f":"B8","v":{"v":0,"d":"0.00"}},{"$f":"D8/$D$5","v":{"$error":"#DIV/0!"}},{"$f":"(D8-B8)/B8","v":{"$error":"#DIV/0!"}},null,null,{"$f":"I9+I10","v":{"v":0,"d":"0.00"}},{"v":0,"d":"0.00"},{"$f":"K9+K10","v":{"v":0,"d":"0.00"}},{"v":0,"d":"0.00"},{"v":0,"d":"0.00"},{"v":0,"d":"0.00"},"Ntot (kg)",{"$f":"P9+P10","v":{"v":0,"d":"0.00"}},{"$f":"Q9+Q10","v":{"v":0,"d":"0.00"}},{"$f":"R9+R10","v":{"v":0,"d":"0.00"}},null,"NH4+ (kg)/N tot",{"$f":"IFERROR(P9/P8,0)","v":0},{"$f":"IFERROR(Q9/Q8,0)","v":0},{"$f":"IFERROR(R9/R8,0)","v":0},null,"N-pertes emissions (kg)",{"$f":"U11+U12+U15+U18","v":0},{"$f":"V11+V12+V15+V18","v":0},{"$f":"W11+W12+W15+W18","v":0}]
["NH4+ (kg)",{"$f":"'Données projet substrat'!AS4","v":{"v":0,"d":"0.0"}},{"$error":"#DIV/0!"},{"$f":"'Données projet substrat'!AT4*1000","v":{"v":0,"d":"0.00"}},{"$error":"#DIV/0!"},{"$error":"#DIV/0!"},{"$f":"IF('Données projet'!B87=\"centrifugeuse\",'BDD modélisation ICV'!B86,IF('Données projet'!B87=\"presse à vis\",'BDD modélisation ICV'!C86,0))","v":{"v":0,"d":"0%"}},{"$f":"D9*(1-'Données projet'!B$88)","v":{"v":0,"d":"0.00"}},{"v":0,"d":"0.00"},{"v":0,"d":"0.00"},{"$f":"IF(G9=0,0,J9*'Données projet'!$B$89)","v":{"v":0,"d":"0.00"}},{"$f":"IF(G9=0,H9,H9+K9)","v":{"v":0,"d":"0.00"}},{"v":0,"d":"0.00"},{"v":0,"d":"0.00"},"NH4+ (kg)",{"$f":"L9*(1-'BDD modélisation ICV'!B96)-L16*18/14","v":0},{"$f":"M9*(1-'BDD modélisation ICV'!C96)-M16*18/14","v":0},{"$f":"N9*(1-'BDD modélisation ICV'!D96)*18/14","v":0},null,"Emissions de N_NH3 avant abattement",{"$f":"U6*'BDD modélisation ICV'!B107/18*14","v":0},{"$f":"V6*'BDD modélisation ICV'!C107/18*14","v":0},{"$f":"W6*'BDD modélisation ICV'!D107/18*14","v":0}]
["Norg (kg)",{"$f":"B8-B9","v":{"v":0,"d":"0.0"}},{"$error":"#DIV/0!"},{"$f":"D8-D9","v":{"v":0,"d":"0.0"}},{"$error":"#DIV/0!"},{"$error":"#DIV/0!"},{"$f":"IF('Données projet'!B87=\"centrifugeuse\",'BDD modélisation ICV'!B85,IF('Données projet'!B87=\"presse à vis\",'BDD modélisation ICV'!C85,0))","v":{"v":0,"d":"0%"}},{"$f":"D10*(1-'Données projet'!B$88)","v":{"v":0,"d":"0.00"}},{"v":0,"d":"0.00"},{"v":0,"d":"0.00"},{"$f":"IF(G10=0,0,J10*'Données projet'!$B$89)","v":{"v":0,"d":"0.00"}},{"$f":"IF(G10=0,H10,H10+K10)","v":{"v":0,"d":"0.00"}},{"v":0,"d":"0.00"},{"v":0,"d":"0.00"},"Norg (kg)",{"$f":"L10*(1-'BDD modélisation ICV'!B95)-L18/44*28","v":0},{"$f":"M10*(1-'BDD modélisation ICV'!C95)-M18/44*28","v":0},{"$f":"N10*(1-'BDD modélisation ICV'!D95)-N18/44*28","v":0},null,"Facteur d'abatemment",{"$f":"_xlfn.XLOOKUP('Données projet'!B93,'BDD modélisation ICV'!A118:A121,'BDD modélisation ICV'!B118:B121,0)","v":0},{"$f":"VLOOKUP('Données projet'!B94,'BDD modélisation ICV'!A118:B121,2,0)","v":0},{"$f":"VLOOKUP('Données projet'!B95,'BDD modélisation ICV'!D118:E121,2,FALSE)","v":0}]
["P2O5 (kg)",{"$f":"'Données projet substrat'!AU4","v":{"v":0,"d":"0.0"}},{"$error":"#DIV/0!"},{"$f":"'Données projet substrat'!AU4","v":{"v":0,"d":"0.00"}},{"$error":"#DIV/0!"},{"$error":"#DIV/0!"},{"$f":"IF('Données projet'!B87=\"centrifugeuse\",'BDD modélisation ICV'!B87,IF('Données projet'!B87=\"presse à vis\",'BDD modélisation ICV'!C87,0))","v":{"v":0,"d":"0%"}},{"$f":"D11*(1-'Données projet'!B$88)","v":{"v":0,"d":"0.00"}},{"v":0,"d":"0.00"},{"v":0,"d":"0.00"},{"$f":"IF(G11=0,0,J11*'Données projet'!$B$89)","v":{"v":0,"d":"0.00"}},{"$f":"IF(G11=0,H11,H11+K11)","v":{"v":0,"d":"0.00"}},{"v":0,"d":"0.00"},{"v":0,"d":"0.00"},"P2O5 (kg)",{"$f":"L11","v":{"v":0,"d":"0.00"}},{"v":0,"d":"0.00"},{"v":0,"d":"0.00"},null,"Emissions de N_NH3 après abattement",{"$f":"U9*(1-U10)","v":0},{"$f":"V9*(1-V10)","v":0},{"$f":"W9*(1-W10)","v":0},null,"N-assimilable (kg) / Ntot (kg)",{"$f":"IFERROR(Z14/U5,0)","v":0},{"$f":"IFERROR(AA14/V5,0)","v":0},{"$f":"IFERROR(AB14/W5,0)","v":0}]
["K2O (kg)",{"$f":"'Données projet substrat'!AV4","v":{"v":0,"d":"0.0"}},{"$error":"#DIV/0!"},{"$f":"'Données projet substrat'!AV4","v":{"v":0,"d":"0.00"}},{"$error":"#DIV/0!"},{"$f":"(D12-B12)/B12","v":{"$error":"#DIV/0!"}},{"$f":"IF('Données projet'!B87=\"centrifugeuse\",'BDD modélisation ICV'!B88,IF('Données projet'!B87=\"presse à vis\",'BDD modélisation ICV'!C88,0))","v":{"v":0,"d":"0%"}},{"$f":"D12*(1-'Données projet'!B$88)","v":{"v":0,"d":"0.00"}},{"v":0,"d":"0.00"},{"v":0,"d":"0.00"},{"$f":"IF(G12=0,0,J12*'Données projet'!$B$89)","v":{"v":0,"d":"0.00"}},{"$f":"IF(G12=0,H12,H12+K12)","v":{"v":0,"d":"0.00"}},{"v":0,"d":"0.00"},{"v":0,"d":"0.00"},"K2O (kg)",{"v":0,"d":"0.00"},{"v":0,"d":"0.00"},{"v":0,"d":"0.00"},null,"Emissions de N-Nox",{"$f":"(U5-U11)*'BDD modélisation ICV'!B108","v":0},{"$f":"(V5-V11)*'BDD modélisation ICV'!C108","v":0},{"$f":"(W5-W11)*'BDD modélisation ICV'!D108","v":0}]
["C (kg)",{"$f":"'Données projet substrat'!AW4","v":{"v":0,"d":"0.0"}},{"$error":"#DIV/0!"},{"$f":"'Données projet substrat'!AZ4*1000","v":{"v":0,"d":"0.00"}},{"$error":"#DIV/0!"},{"$f":"(D13-B13)/B13","v":{"$error":"#DIV/0!"}},{"$f":"G7","v":{"v":0,"d":"0%"}},{"$f":"D13*(1-'Données projet'!B$88)","v":{"v":0,"d":"0.00"}},{"v":0,"d":"0.00"},{"v":0,"d":"0.00"},{"$f":"IF(G13=0,0,J13*'Données projet'!$B$89)","v":{"v":0,"d":"0.00"}},{"$f":"IF(G13=0,H13,H13+K13)","v":{"v":0,"d":"0.00"}},{"v":0,"d":"0.00"},{"v":0,"d":"0.00"},"C (kg)",{"$f":"L13*(1-'BDD modélisation ICV'!B97)","v":0},{"$f":"M13*(1-'BDD modélisation ICV'!C97)","v":0},{"$f":"N13*(1-'BDD modélisation ICV'!D97)","v":0},null,"Emissions de N2O indirect (via NH3 et Nox)",{"$f":"(U11+U12)*'BDD modélisation ICV'!B110","v":0},{"$f":"(V11+V12)*'BDD modélisation ICV'!C110","v":0},{"$f":"(W11+W12)*'BDD modélisation ICV'!D110","v":0}]
[{"$nulls":10},"Emissions de CH4",{"$f":"IF('Données projet'!B91=\"couvert avec récupération du biogaz\",0,(L13-P13)*'BDD modélisation ICV'!B101/12*16)","v":0},{"$f":"IF('Données projet'!B90=\"couvert avec récupération du biogaz\",0,(M13-Q13)*'BDD modélisation ICV'!C101/12*16)","v":0},{"$f":"(N13-R13)*'BDD modélisation ICV'!D101/12*16","v":0},{"$nulls":10},"MFE - N (kg)",{"$f":"Z6+Z7-Z8","v":{"v":0,"d":"0.00"}},{"$f":"AA6+AA7-AA8","v":{"v":0,"d":"0.00"}},{"$f":"AB6+AB7-AB8","v":{"v":0,"d":"0.00"}}]
[{"$nulls":10},"Emissions de CO2",{"$f":"(L13-P13)*(1-'BDD modélisation ICV'!B101)/12*44","v":0},{"$f":"(M13-Q13)*(1-'BDD modélisation ICV'!C101)/12*44","v":0},{"$f":"(N13-R13)*(1-'BDD modélisation ICV'!D101)/12*44","v":0},{"$nulls":5},"Lessivage de N-NO3-",{"$f":"(U5)*'BDD modélisation ICV'!B111","v":0},{"$f":"(V5)*'BDD modélisation ICV'!C111","v":0},{"$f":"(W5)*'BDD modélisation ICV'!D111","v":0},null,"MFE - P2O5 (kg)",{"$f":"P11*0.95","v":{"v":0,"d":"0.00"}},{"$f":"Q11*0.95","v":{"v":0,"d":"0.00"}},{"$f":"R11*0.95","v":{"v":0,"d":"0.00"}}]
[{"$nulls":10},"Emissions de N_NH3",{"$f":"IF(OR('Données projet'!B91=\"couvert avec récupération du biogaz\",'Données projet'!B91=\"couvert\"),L9*'BDD modélisation ICV'!B102/18*14*0.3,L9*'BDD modélisation ICV'!B102/18*14)","v":0},{"$f":"IF(OR('Données projet'!B90=\"couvert avec récupération du biogaz\",'Données projet'!B90=\"couvert\"),M9*'BDD modélisation ICV'!C102/18*14*0.3,M9*'BDD modélisation ICV'!C102/18*14)","v":0},{"$f":"(N9-R9)*'BDD modélisation ICV'!D102/18*14","v":{"v":0,"d":"0.00"}},"Débit de chantier d'épandage (h)",{"$f":"P5/'BDD modélisation ICV'!B122","v":0},{"$f":"Q5/'BDD modélisation ICV'!B122","v":0},{"$f":"R5/'BDD modélisation ICV'!E122","v":0},null,"Emissions de N-N2O indirect (via NO3-)",{"$f":"U15*'BDD modélisation ICV'!B112","v":0},{"$f":"V15*'BDD modélisation ICV'!C112","v":0},{"$f":"W15*'BDD modélisation ICV'!D112","v":0},null,"MFE - K2O (kg)",{"$f":"P12","v":{"v":0,"d":"0.00"}},{"$f":"Q12","v":{"v":0,"d":"0.00"}},{"$f":"R12","v":{"v":0,"d":"0.00"}}]
[{"$nulls":10},"Emissions de N2O (indirect)",{"$f":"(L16*0.01)/28*44","v":0},{"$f":"(M16*0.01)/28*44","v":0},0,"L de diesel pour l'épandage",{"$f":"P16*'BDD ITK culture'!R14","v":0},{"$f":"Q16*'BDD ITK culture'!R14","v":0},{"$f":"R16*'BDD ITK culture'!S14","v":0}]
[{"$nulls":10},"Emissions de N2O (direct)",{"$f":"IF(OR('Données projet'!B91=\"couvert avec récupération du biogaz\",'Données projet'!B91=\"couvert\"),L9*'BDD modélisation ICV'!B103/28*44*0.3,L9*'BDD modélisation ICV'!B103/28*44)","v":0},{"$f":"IF(OR('Données projet'!B91=\"couvert avec récupération du biogaz\",'Données projet'!B91=\"couvert\"),M9*'BDD modélisation ICV'!C103/28*44*0.3,M9*'BDD modélisation ICV'!C103/28*44)","v":0},{"$f":"((N9-R9)*'BDD modélisation ICV'!D103)/28*44","v":0},"kg de diesel pour l'épandage",{"$f":"P17*'BDD modélisation ICV'!A135","v":0},{"$f":"Q17*'BDD modélisation ICV'!A135","v":0},{"$f":"R17*'BDD modélisation ICV'!A135","v":0},null,"Emissions directes de N-N2O",{"$f":"U5*'BDD modélisation ICV'!B113","v":0},{"$f":"V5*'BDD modélisation ICV'!C113","v":0},{"$f":"W5*'BDD modélisation ICV'!D113","v":0},null,"N-répartition entre les phases",{"$f":"IFERROR(Z14/SUM($Z$14:$AB$14),0)","v":0},{"$f":"IFERROR(AA14/SUM($Z$14:$AB$14),0)","v":0},{"$f":"IFERROR(AB14/SUM($Z$14:$AB$14),0)","v":0}]
[{"$nulls":10},"kg eq CO2 20 ans",{"$f":"L14*FC_CH4B20+(L18+L17)*FC_N2O20","v":0},{"$f":"M14*FC_CH4B20+(M18+M17)*FC_N2O20","v":0},{"$f":"N14*FC_CH4B20+(N18+N17)*FC_N2O20","v":0},"kg eq CO2 20 ans",{"$f":"$P$18*('BDD export Ecoinvent - SIMAPRO'!D8+'BDD export Ecoinvent - SIMAPRO'!E8)","v":0},{"$f":"$Q$18*('BDD export Ecoinvent - SIMAPRO'!D8+'BDD export Ecoinvent - SIMAPRO'!E8)","v":0},{"$f":"$R$18*('BDD export Ecoinvent - SIMAPRO'!D8+'BDD export Ecoinvent - SIMAPRO'!E8)","v":0},{"$nulls":6},"N (kg) -digestat sur CIVES et cultures principales du système de méthanisation",{"$f":"'Données projet substrat'!CD4","v":{"v":0,"d":"0.00"}}]
[{"$nulls":10},"kg eq CO2 100 ans",{"$f":"L14*FC_CH4B100+(L17+L18)*FC_N2O100","v":0},{"$f":"M14*FC_CH4B100+(M17+M18)*FC_N2O100","v":0},{"$f":"N14*FC_CH4B100+(N17+N18)*FC_N2O100","v":0},"kg eq CO2 100 ans",{"$f":"$P$18*('BDD export Ecoinvent - SIMAPRO'!D9+'BDD export Ecoinvent - SIMAPRO'!E9)","v":0},{"$f":"$Q$18*('BDD export Ecoinvent - SIMAPRO'!D9+'BDD export Ecoinvent - SIMAPRO'!E9)","v":0},{"$f":"$R$18*('BDD export Ecoinvent - SIMAPRO'!D9+'BDD export Ecoinvent - SIMAPRO'!E9)","v":0},null,"Emissions totales de N-N2O",{"$f":"U13+U16+U18","v":0},{"$f":"V13+V16+V18","v":0},{"$f":"W13+W16+W18","v":0}]
[{"$nulls":14},"Ressources fossiles et nucléaires (kWh eq)",{"$f":"$P$18*('BDD export Ecoinvent - SIMAPRO'!D10+'BDD export Ecoinvent - SIMAPRO'!E10)","v":0},{"$f":"$Q$18*('BDD export Ecoinvent - SIMAPRO'!D10+'BDD export Ecoinvent - SIMAPRO'!E10)","v":0},{"$f":"$R$18*('BDD export Ecoinvent - SIMAPRO'!D10+'BDD export Ecoinvent - SIMAPRO'!E10)","v":0},null,"kg eq CO2 20 ans",{"$f":"U20/28*44*FC_N2O20","v":0},{"$f":"V20/28*44*FC_N2O20","v":0},{"$f":"W20/28*44*FC_N2O20","v":0},null,"N (kg) -digestat sur CIVES et cultures principales du système de méthanisation - répartition entre les phases produites par le système",{"$f":"$Z$19*Z18","v":0},{"$f":"$Z$19*AA18","v":0},{"$f":"$Z$19*AB18","v":0}]
[{"$nulls":10},"Emissions de N_N2O (direct)",{"$f":"IF(OR('Données projet'!B91=\"couvert avec récupération du biogaz\",'Données projet'!B91=\"couvert\"),L9*'BDD modélisation ICV'!B103*0.3,L9*'BDD modélisation ICV'!B103)","v":0},{"$f":"IF(OR('Données projet'!B91=\"couvert avec récupération du biogaz\",'Données projet'!B91=\"couvert\"),M9*'BDD modélisation ICV'!C103*0.3,M9*'BDD modélisation ICV'!C103)","v":0},{"$f":"((N9-R9)*'BDD modélisation ICV'!D103)","v":0},{"$nulls":5},"kg eq CO2 100 ans",{"$f":"U20/28*44*FC_N2O100","v":0},{"$f":"V20/28*44*FC_N2O100","v":0},{"$f":"W20/28*44*FC_N2O100","v":0},null,"N (kg) - exporté",{"$f":"IF(Z14-Z21<0,0,Z14-Z21)","v":{"v":0,"d":"0.00"}},{"$f":"IF(AA14-AA21<0,0,AA14-AA21)","v":{"v":0,"d":"0.00"}},{"$f":"IF(AB14-AB21<0,0,AB14-AB21)","v":{"v":0,"d":"0.00"}}]
[null,"Cultures dédiées","Cultures dédiées déclassées","CIVE d'hiver","CIVE d'été",{"$nulls":19},"P2O5 (kg) - exporté",{"$f":"IFERROR(Z15*Z22/Z14,0)","v":0},{"$f":"IFERROR(AA15*AA22/AA14,0)","v":0},{"$f":"IFERROR(AB15*AB22/AB14,0)","v":0}]
["t de MS issu d'un ensilage",{"$f":"SUMIF('Données projet substrat'!D6:D1795,\"Cultures principales\",'Données projet substrat'!V6:V1795)","v":0},{"$f":"SUMIF('Données projet substrat'!D6:D1795,\"Cultures principales déclassées\",'Données projet substrat'!V6:V1795)","v":0},{"$f":"SUMIF('Données projet substrat'!D6:D1795,\"CIVE d'hiver\",'Données projet substrat'!V6:V1795)","v":0},{"$f":"SUMIF('Données projet substrat'!D6:D1795,\"CIVE d'été\",'Données projet substrat'!V6:V1795)","v":0},{"$nulls":5},"kg CO2 biogénique",{"$f":"L15","v":0},{"$f":"M15","v":0},{"$f":"N15","v":0},{"$nulls":5},"Sommes",{"$nulls":4},"K2O (kg) - exporté",{"$f":"IFERROR(Z16*Z22/Z14,0)","v":0},{"$f":"IFERROR(AA16*AA22/AA14,0)","v":0},{"$f":"IFERROR(AB16*AB22/AB14,0)","v":0}]
["Emissions de CH4",{"$f":"SUM(B24:C24)*1000*'BDD modélisation ICV'!E6/1000","v":0},null,{"$f":"SUM(D24:E24)*1000*'BDD modélisation ICV'!E6/1000","v":0},{"$nulls":6},"Emissions de méthane rapportées à la production exprimée",{"$nulls":8},"N_NH3",{"$f":"SUM(L16:N16,U11:W11,U12:W12)","v":0}]
["Emissions de N2O (direct)",{"$f":"SUM(B24:C24)/1000*'BDD modélisation ICV'!F6*1000","v":0},null,{"$f":"SUM(D24:E24)/1000*'BDD modélisation ICV'!F6*1000","v":0},{"$nulls":6},{"$f":"SUM(L26:N26)","v":{"$error":"#DIV/0!"}},{"$f":"L14/($C$80*1000)","v":{"$error":"#DIV/0!"}},{"$f":"M14/($C$80*1000)","v":{"$error":"#DIV/0!"}},{"$f":"N14/($C$80*1000)","v":{"$error":"#DIV/0!"}},{"$nulls":5},"N_N20 direct",{"$f":"SUM(L22:N22)*28/44+SUM(U18:W18)","v":0}]
["kg eq CO2 20 ans",{"$f":"B25*FC_CH4B20+B26*FC_N2O20","v":0},null,{"$f":"D25*FC_CH4B20+D26*FC_N2O20","v":0},{"$nulls":15},"N_NO3-",{"$f":"SUM(U15:W15)","v":0}]
["kg eq CO2 100 ans",{"$f":"B25*FC_CH4B100+B26*FC_N2O100","v":0},null,{"$f":"D25*FC_CH4B100+D26*FC_N2O100","v":0},{"$nulls":7},{"$f":"IF(OR('Données projet'!B91=\"couvert avec récupération du biogaz\",'Données projet'!B91=\"couvert\"),L9*'BDD modélisation ICV'!B102/18*14*0.7,L9*'BDD modélisation ICV'!B102/18*14)","v":0},{"$f":"IF(OR('Données projet'!B90=\"couvert avec récupération du biogaz\",'Données projet'!B90=\"couvert\"),M9*'BDD modélisation ICV'!C102/18*14*0.7,M9*'BDD modélisation ICV'!C102/18*14)","v":0},{"$nulls":7},{"$f":"SUM(U25:U27)","v":0}]
[]
[]
["2. ITK"]
["Consommation tracteurs","Cultures principales","CIVES"]
["Consommation diesel (kg)",{"$f":"SUMIF('Données projet substrat'!D6:D1795,\"Cultures principales\",'Données projet substrat'!BQ6:BQ1795)","v":{"v":0,"d":"0.00"}},{"$f":"SUMIF('Données projet substrat'!D6:D1795,\"CIVE*\",'Données projet substrat'!BQ6:BQ1795)","v":{"v":0,"d":"0.00"}}]
["kg eq CO2 20 ans",{"$f":"$B$33*('BDD export Ecoinvent - SIMAPRO'!D8+'BDD export Ecoinvent - SIMAPRO'!E8)","v":{"v":0,"d":"0.00"}},{"$f":"$C$33*('BDD export Ecoinvent - SIMAPRO'!D8+'BDD export Ecoinvent - SIMAPRO'!E8)","v":{"v":0,"d":"0.00"}}]
["kg eq CO2 100 ans",{"$f":"$B$33*('BDD export Ecoinvent - SIMAPRO'!D9+'BDD export Ecoinvent - SIMAPRO'!E9)","v":{"v":0,"d":"0.00"}},{"$f":"$C$33*('BDD export Ecoinvent - SIMAPRO'!D9+'BDD export Ecoinvent - SIMAPRO'!E9)","v":{"v":0,"d":"0.00"}}]
["Ressources fossiles et nucléaires (kWh eq)",{"$f":"B33*('BDD export Ecoinvent - SIMAPRO'!E10+'BDD export Ecoinvent - SIMAPRO'!D10)","v":{"v":0,"d":"0.00"}},{"$f":"C33*('BDD export Ecoinvent - SIMAPRO'!E10+'BDD export Ecoinvent - SIMAPRO'!D10)","v":{"v":0,"d":"0.00"}}]
["Fertlisation minérale","Cultures principales","CIVES"]
["Fertilisation N (kg)",{"$f":"SUMIF('Données projet substrat'!D6:D1795,\"Cultures principales\",'Données projet substrat'!CB6:CB1795)","v":{"v":0,"d":"0.00"}},{"$f":"SUMIF('Données projet substrat'!D6:D1795,\"CIVE*\",'Données projet substrat'!CB6:CB1795)","v":{"v":0,"d":"0.00"}}]
["Fertilisation K (kg)",{"$f":"SUMIF('Données projet substrat'!D6:D1795,\"Cultures principales\",'Données projet substrat'!CE6:CE1795)","v":{"v":0,"d":"0.00"}},{"$f":"SUMIF('Données projet substrat'!D6:D1795,\"CIVE*\",'Données projet substrat'!CE6:CE1795)","v":{"v":0,"d":"0.00"}}]
["Fertilisation P (kg)",{"$f":"SUMIF('Données projet substrat'!D6:D1795,\"Cultures principales\",'Données projet substrat'!CF6:CF1795)","v":{"v":0,"d":"0.00"}},{"$f":"SUMIF('Données projet substrat'!D6:D1795,\"CIVE*\",'Données projet substrat'!CF6:CF1795)","v":{"v":0,"d":"0.00"}}]
["kg eq CO2 20 ans",{"$f":"$B$38*('BDD export Ecoinvent - SIMAPRO'!G8+'BDD export Ecoinvent - SIMAPRO'!D49)+$B$39*'BDD export Ecoinvent - SIMAPRO'!I8+$B$40*'BDD export Ecoinvent - SIMAPRO'!H8","v":{"v":0,"d":"0.00"}},{"$f":"$C$38*('BDD export Ecoinvent - SIMAPRO'!G8+'BDD export Ecoinvent - SIMAPRO'!D49)+$C$39*'BDD export Ecoinvent - SIMAPRO'!I8+$C$40*'BDD export Ecoinvent - SIMAPRO'!H8","v":{"v":0,"d":"0.00"}}]
["kg eq CO2 100 ans",{"$f":"$B$38*('BDD export Ecoinvent - SIMAPRO'!G9+'BDD export Ecoinvent - SIMAPRO'!D50)+$B$39*'BDD export Ecoinvent - SIMAPRO'!I9+$B$40*'BDD export Ecoinvent - SIMAPRO'!H9","v":{"v":0,"d":"0.00"}},{"$f":"$C$38*('BDD export Ecoinvent - SIMAPRO'!G9+'BDD export Ecoinvent - SIMAPRO'!D50)+$C$39*'BDD export Ecoinvent - SIMAPRO'!I9+$C$40*'BDD export Ecoinvent - SIMAPRO'!H9","v":{"v":0,"d":"0.00"}}]
["Ressources fossiles et nucléaires (kWh eq)",{"$f":"$B$38*'BDD export Ecoinvent - SIMAPRO'!G10+$B$39*'BDD export Ecoinvent - SIMAPRO'!I10+$B$40*'BDD export Ecoinvent - SIMAPRO'!H10","v":{"v":0,"d":"0.00"}},{"$f":"$C$38*'BDD export Ecoinvent - SIMAPRO'!G10+$C$39*'BDD export Ecoinvent - SIMAPRO'!I10+$C$40*'BDD export Ecoinvent - SIMAPRO'!H10","v":{"v":0,"d":"0.00"}}]
["Fertilisation organique","Cultures principales","CIVES"]
["Fertilisation N (kg)",{"$f":"SUMIF('Données projet substrat'!D6:D1795,\"Cultures principales\",'Données projet substrat'!CC6:CC1795)","v":{"v":0,"d":"0.00"}},{"$f":"SUMIF('Données projet substrat'!D6:D1795,\"CIVE*\",'Données projet substrat'!CC6:CC1795)","v":{"v":0,"d":"0.00"}},null,null,"Epandage d'effluent organique suivant IPCC (2019) - Cultures principales","Epandage d'effluent organique suivant IPCC (2019) - CIVES"]
["Fertilisation K (kg)",{"$f":"SUMIF('Données projet substrat'!D6:D1795,\"Cultures principales\",'Données projet substrat'!CE6:CE1795)","v":{"v":0,"d":"0.00"}},{"$f":"SUMIF('Données projet substrat'!D6:D1795,\"CIVE*\",'Données projet substrat'!CE6:CE1795)","v":{"v":0,"d":"0.00"}},null,"Ntot (kg)",{"$f":"B45","v":{"v":0,"d":"0.00"}},{"$f":"C45","v":{"v":0,"d":"0.00"}}]
["Fertilisation P (kg)",{"$f":"SUMIF('Données projet substrat'!D6:D1795,\"Cultures principales\",'Données projet substrat'!CF6:CF1795)","v":{"v":0,"d":"0.00"}},{"$f":"SUMIF('Données projet substrat'!D6:D1795,\"CIVE*\",'Données projet substrat'!CF6:CF1795)","v":{"v":0,"d":"0.00"}},null,"Emissions de N_NH3 après abattement",{"$f":"F46*'BDD modélisation ICV'!$H$109","v":0},{"$f":"G46*'BDD modélisation ICV'!$H$109","v":0}]
["kg eq CO2 20 ans",{"$f":"F53","v":{"v":0,"d":"0.00"}},{"$f":"G53","v":{"v":0,"d":"0.00"}},null,"Emissions de N2O indirect (via NH3 et Nox)",{"$f":"F47*'BDD modélisation ICV'!$H$110","v":0},{"$f":"G47*'BDD modélisation ICV'!$H$110","v":0}]
["kg eq CO2 100 ans",{"$f":"F54","v":{"v":0,"d":"0.00"}},{"$f":"G54","v":{"v":0,"d":"0.00"}},null,"Lessivage de N-NO3-",{"$f":"F46*'BDD modélisation ICV'!$H$111","v":0},{"$f":"G46*'BDD modélisation ICV'!$H$111","v":0}]
["kg CO2 biogénique",{"$nulls":3},"Emissions de N-N2O indirect (via NO3-)",{"$f":"F49*'BDD modélisation ICV'!$H$112","v":0},{"$f":"G49*'BDD modélisation ICV'!$H$112","v":0}]
["Ressources fossiles et nucléaires (kWh eq)",{"$nulls":3},"Emissions directes de N-N2O",{"$f":"F46*'BDD modélisation ICV'!$H$113","v":0},{"$f":"G46*'BDD modélisation ICV'!$H$113","v":0}]
["Application de produits phytosanitaires","Cultures principales","CIVES",null,"Emissions totales de N-N2O",{"$f":"F48+F50+F51","v":0},{"$f":"G48+G50+G51","v":0}]
["Phytosanitaires (kg)",{"$f":"SUMIF('Données projet substrat'!D6:D1795,\"Cultures principales\",'Données projet substrat'!CG6:CG1795)","v":{"v":0,"d":"0.00"}},{"$f":"SUMIF('Données projet substrat'!D6:D1795,\"CIVE*\",'Données projet substrat'!CG6:CG1795)","v":{"v":0,"d":"0.00"}},null,"kg eq CO2 20 ans",{"$f":"F52/28*44*FC_N2O20","v":0},{"$f":"G52/28*44*FC_N2O20","v":0}]
["kg eq CO2 20 ans",{"$f":"$B$53*'BDD export Ecoinvent - SIMAPRO'!J8","v":{"v":0,"d":"0.00"}},{"$f":"$C$53*'BDD export Ecoinvent - SIMAPRO'!J8","v":{"v":0,"d":"0.00"}},null,"kg eq CO2 100 ans",{"$f":"F52/28*44*FC_N2O100","v":0},{"$f":"G52/28*44*FC_N2O100","v":0}]
["kg eq CO2 100 ans",{"$f":"$B$53*'BDD export Ecoinvent - SIMAPRO'!J9","v":{"v":0,"d":"0.00"}},{"$f":"$C$53*'BDD export Ecoinvent - SIMAPRO'!J9","v":{"v":0,"d":"0.00"}}]
["Ressources fossiles et nucléaires (kWh eq)",{"$f":"$B$53*'BDD export Ecoinvent - SIMAPRO'!J10","v":{"v":0,"d":"0.00"}},{"$f":"$C$53*'BDD export Ecoinvent - SIMAPRO'!J10","v":{"v":0,"d":"0.00"}}]
[]
["3. Transport"]
["Transport collecte au diesel (t.km)",{"$f":"SUMPRODUCT('Données projet substrat'!I6:I1880,(1-'Données projet substrat'!J6:J1880))+SUMPRODUCT(IF('Données projet substrat'!E6:E1880=\"Soupe de déconditionnement\",'Données projet substrat'!G6:G1880*(1-'Données projet substrat'!J6:J1880)*'Données projet'!$B$18))","v":0}]
["kg eq CO2 20 ans",{"$f":"B59*'BDD export Ecoinvent - SIMAPRO'!F8","v":{"v":0,"d":"0.00"}}]
["kg eq CO2 100 ans",{"$f":"B59*'BDD export Ecoinvent - SIMAPRO'!F9","v":{"v":0,"d":"0.00"}}]
["Ressources fossiles et nucléaires (kWh eq)",{"$f":"B59*'BDD export Ecoinvent - SIMAPRO'!F10","v":{"v":0,"d":"0.00"}}]
["Transport collecte au bioGNV (t.km)",{"$f":"SUMPRODUCT('Données projet substrat'!I6:I1880,'Données projet substrat'!J6:J1880)","v":0}]
["Transport digestat (t.km)",{"$f":"'Données projet'!B92*SUM(P5:R5)","v":{"$error":"#VALUE!"}}]
["kg eq CO2 20 ans",{"$f":"B64*'BDD export Ecoinvent - SIMAPRO'!F8","v":{"$error":"#VALUE!"}}]
["kg eq CO2 100 ans",{"$f":"B64*'BDD export Ecoinvent - SIMAPRO'!F9","v":{"$error":"#VALUE!"}}]
["kg CO2 biogénique"]
["Ressources fossiles et nucléaires (kWh eq)",{"$f":"B64*'BDD export Ecoinvent - SIMAPRO'!F10","v":{"$error":"#VALUE!"}}]
[]
["4. Emissions fugitives"]
["% émissions fugitives",{"$f":"'Données projet'!C83","v":{"v":0.05,"d":"5.0%"}}]
["GES émis à 100 ans",{"$f":"(B28+D28+B35+B180+B42+B49+B55+C35+F180+C42+C49+C55+SUMIF('Données projet substrat'!F6:F14,\"Fumier\",'Données projet substrat'!CI6:CI14)+SUMIF('Données projet substrat'!F6:F14,\"Lisier\",'Données projet substrat'!CI6:CI14)+B61+C218*B213+C219*L213*L211+IF(B218=1,B239,C213*C211+C219*M213)+F87+B96+B199+C218*D211*D213+B87+C218*K211*K213+B109+B128+C218*G211*G213+C218*H211*H213+B146+C218*I211*I213+B154+B167+C218*J211*J213+B192+B180+C218*E211*E213+C218*F211*F213+L20+M20+N20+P20+U22+Q20+V22+R20+W22+B66)/1000","v":{"$error":"#VALUE!"}}]
["GES évités à 100 ans",{"$f":"(-B246-B265-B269-B273-B250-B254-B304-B259)/1000","v":{"v":0,"d":"0.00"}}]
["Score net aggrégé à 100 ans (t éq CO2)",{"$f":"B72+B73","v":{"$error":"#VALUE!"}}]
[]
["5. Flux de gaz (énergie primaire)"]
["Calculs généraux (cogé ET épuration/injection)"]
[null,"Volume (m3)","Masse (t)","MJ","kWh","Résultats des infrastructures du digesteur"]
["Digesteur"]
["CH4 produit dans le digesteur",{"$f":"'Données projet substrat'!AB4","v":{"v":0,"d":"0.00"}},{"$f":"B80*massevol_CH4/1000","v":{"v":0,"d":"0.00"}},{"$f":"C80*1000*PCI_CH4","v":{"v":0,"d":"0.00"}},{"$f":"D80/3.6","v":{"v":0,"d":"0.00"}}]
["CO2 produit dans le digesteur",{"$f":"'Données projet substrat'!AI4","v":{"v":0,"d":"0.00"}},{"$f":"B81*massevol_CO2/1000","v":{"v":0,"d":"0.00"}}]
["% CH4",{"$f":"B80/(B80+B81)","v":{"$error":"#DIV/0!"}},{"$f":"C80/(C80+C81)","v":{"$error":"#DIV/0!"}}]
["Biogaz total produit dans le digesteur",{"$f":"B80+B81","v":{"v":0,"d":"0.00"}},{"$f":"C80+C81","v":{"v":0,"d":"0.00"}}]
["CH4 émissions fugitives",{"$f":"B80*B71","v":{"v":0,"d":"0.00"}},{"$f":"B84*massevol_CH4/1000","v":{"v":0,"d":"0.00"}},{"$f":"C84*1000*PCI_CH4","v":{"v":0,"d":"0.00"}},{"$f":"D84/3.6","v":{"v":0,"d":"0.00"}}]
["CO2 émissions fugitives",{"$f":"B81*B71","v":{"v":0,"d":"0.00"}},{"$f":"B85*massevol_CO2/1000","v":{"v":0,"d":"0.00"}}]
["kg eq CO2 20 ans",{"$f":"C84*1000*FC_CH4B20","v":{"v":0,"d":"0.00"}},null,null,"kg eq CO2 20 ans",{"$f":"B83*'BDD export Ecoinvent - SIMAPRO'!X8*3.36311842881788E-08","v":{"v":0,"d":"0.00"}}]
["kg eq CO2 100 ans",{"$f":"C84*1000*FC_CH4B100","v":{"v":0,"d":"0.00"}},null,null,"kg eq CO2 100 ans",{"$f":"B83*'BDD export Ecoinvent - SIMAPRO'!X9*3.36311842881788E-08","v":{"v":0,"d":"0.00"}}]
["kg CO2 biogénique",{"$f":"C85*1000","v":{"v":0,"d":"0.00"}},null,null,"Ressources fossiles et nucléaires (kWh eq)",{"$f":"B83*'BDD export Ecoinvent - SIMAPRO'!X10*3.36311842881788E-08","v":{"v":0,"d":"0.00"}}]
[]
["Torchère"]
["CH4 torché",{"$f":"(B80-B84)*'Données projet'!B26","v":{"v":0,"d":"0.00"}},{"$f":"B91*massevol_CH4/1000","v":{"v":0,"d":"0.00"}},{"$f":"C91*1000*PCI_CH4","v":{"v":0,"d":"0.00"}},{"$f":"D91/3.6","v":{"v":0,"d":"0.00"}}]
["CH4 torché imbrulé",{"$f":"B91*'BDD modélisation ICV'!$B$72","v":{"v":0,"d":"0.00"}},{"$f":"B92*massevol_CH4/1000","v":{"v":0,"d":"0.00E+00"}},{"$f":"C92*1000*PCI_CH4","v":{"v":0,"d":"0.00"}},{"$f":"D92/3.6","v":{"v":0,"d":"0.00"}}]
["N2O produit par la combustion",{"$f":"E91*'BDD modélisation ICV'!$C$71","v":{"v":0,"d":"0.00E+00"}},{"$f":"B93*massevol_N2O/1000","v":{"v":0,"d":"0.00E+00"}}]
["CO2 torché",{"$f":"(B81-B85)*'BDD modélisation ICV'!$B$71","v":{"v":0,"d":"0.00"}},{"$f":"B94*massevol_CO2/1000","v":{"v":0,"d":"0.00"}}]
["kg eq CO2 20 ans",{"$f":"C92*1000*FC_CH4B20+C93*1000*FC_N2O20","v":{"v":0,"d":"0.00"}}]
["kg eq CO2 100 ans",{"$f":"C92*1000*FC_CH4B100+C93*1000*FC_N2O100","v":{"v":0,"d":"0.00"}}]
["kg CO2 biogénique",{"$f":"(C91*(44/16)+C94)*1000","v":{"v":0,"d":"0.00"}}]
[]
["Installation en cogénération"]
["Cogénérateur"]
["Biogaz détourné en épuration pour autoconsommation",{"$f":"B83*'Données projet'!B57","v":{"v":0,"d":"0.00"}},{"$f":"C102+C103","v":{"v":0,"d":"0.00"}}]
["CH4 détourné en épuration pour autoconsommation",{"$f":"B80*'Données projet'!B57","v":{"v":0,"d":"0.00"}},{"$f":"B102*massevol_CH4/1000","v":{"v":0,"d":"0.00"}},{"$f":"C102*1000*PCI_CH4","v":{"v":0,"d":"0.00"}},{"$f":"D102/3.6","v":{"v":0,"d":"0.00"}}]
["CO2 détourné en épuration pour autoconsommation",{"$f":"B81*'Données projet'!B57","v":{"v":0,"d":"0.00"}},{"$f":"B103*massevol_CO2/1000","v":{"v":0,"d":"0.00"}}]
["CH4 total envoyé en cogé",{"$f":"IF('Données projet'!B9=\"cogénération\",B80-B84-B91-B102,B114)","v":{"v":0,"d":"0.00"}},{"$f":"B104*massevol_CH4/1000","v":{"v":0,"d":"0.00"}},{"$f":"C104*1000*PCI_CH4","v":{"v":0,"d":"0.00"}},{"$f":"D104/3.6","v":{"v":0,"d":"0.00"}}]
["CH4 imbrulé en cogé",{"$f":"B104*'BDD modélisation ICV'!B73","v":{"v":0,"d":"0.00"}},{"$f":"B105*massevol_CH4/1000","v":{"v":0,"d":"0.00"}},{"$f":"C105*1000*PCI_CH4","v":{"v":0,"d":"0.00"}},{"$f":"D105/3.6","v":{"v":0,"d":"0.00"}}]
["CH4 total valorisable",{"$f":"B104-B105","v":{"v":0,"d":"0.00"}},{"$f":"C104-C105","v":{"v":0,"d":"0.00"}},{"$f":"C106*1000*PCI_CH4","v":{"v":0,"d":"0.00"}},{"$f":"D106/3.6","v":{"v":0,"d":"0.00"}}]
["CO2 total contenu dans le biogaz",{"$f":"IF('Données projet'!B9=\"cogénération\",B81-B85-B94,0)","v":{"v":0,"d":"0.00"}},{"$f":"B107*massevol_CO2/1000","v":{"v":0,"d":"0.00"}}]
["kg eq CO2 20 ans",{"$f":"C105*1000*FC_CH4B20","v":{"v":0,"d":"0.00"}}]
["kg eq CO2 100 ans",{"$f":"C105*1000*FC_CH4B100","v":{"v":0,"d":"0.00"}}]
["kg CO2 biogénique",{"$f":"0","v":{"v":0,"d":"0.00"}}]
[]
["Installation en épuration/injection"]
["Epurateur"]
["Biogaz détourné vers une cogénatrice pour autoconsommation",{"$f":"B115+B116","v":{"v":0,"d":"0.00"}},{"$f":"C115+C116","v":{"v":0,"d":"0.00"}}]
["CH4 détourné vers une cogénatrice pour autoconsommation",{"$f":"((B80-B84-B91)*('Données projet'!B60))*(1-'BDD modélisation ICV'!B73)","v":{"v":0,"d":"0.00"}},{"$f":"B115*massevol_CH4/1000","v":{"v":0,"d":"0.00"}},{"$f":"C115*1000*PCI_CH4","v":{"v":0,"d":"0.00"}},{"$f":"D115/3.6","v":{"v":0,"d":"0.00"}}]
["CO2 détourné vers une cogénatrice pour autoconsommation",{"$f":"(B81-B85-B94)*('Données projet'!B60)","v":{"v":0,"d":"0.00"}},{"$f":"B116*massevol_CO2/1000","v":{"v":0,"d":"0.00"}}]
["Biogaz en entrée d'épurateur",{"$f":"IF('Données projet'!B9=\"Epuration/injection\",(B83-B84-B85-B91-B94)*(1-'Données projet'!B60),B101)","v":{"v":0,"d":"0.00"}},{"$f":"IF('Données projet'!B9=\"Epuration/injection\",C119+C118,0)","v":{"v":0,"d":"0.00"}}]
["CH4 en entrée d'épurateur",{"$f":"IF('Données projet'!B9=\"Epuration/injection\",(B80-B84-B91)*(1-'Données projet'!B60),B102)","v":{"v":0,"d":"0.00"}},{"$f":"B118*massevol_CH4/1000","v":{"v":0,"d":"0.00"}},{"$f":"C118*1000*PCI_CH4","v":{"v":0,"d":"0.00"}},{"$f":"D118/3.6","v":{"v":0,"d":"0.00"}}]
["CO2 en entrée d'épurateur",{"$f":"IF('Données projet'!B9=\"Epuration/injection\",(B81-B85-B94)*(1-'Données projet'!B60),B103)","v":{"v":0,"d":"0.00"}},{"$f":"B119*massevol_CO2/1000","v":{"v":0,"d":"0.00"}}]
["Rendement épurateur",{"$f":"IF('Données projet'!B61=\"membranaire\",'BDD modélisation ICV'!B48,'BDD modélisation ICV'!$B$49)","v":{"v":0.97,"d":"97.0%"}}]
["Pureté du biométhane",{"$f":"'BDD modélisation ICV'!$D$48","v":{"v":0.97,"d":"97.0%"}}]
["Off-gaz (CH4)",{"$f":"B118*(1-B120)","v":{"v":0,"d":"0.00"}},{"$f":"B122*massevol_CH4/1000","v":{"v":0,"d":"0.00"}},{"$f":"C122*1000*PCI_CH4","v":{"v":0,"d":"0.00"}},{"$f":"D122/3.6","v":{"v":0,"d":"0.00"}}]
["Off-gaz (CO2)",{"$f":"B119-B125","v":{"v":0,"d":"0.00"}},{"$f":"B123*massevol_CO2/1000","v":{"v":0,"d":"0.00"}}]
["Biométhane en sortie d'épurateur (CH4)",{"$f":"(B118*B120)","v":{"v":0,"d":"0.00"}},{"$f":"B124*massevol_CH4/1000","v":{"v":0,"d":"0.00"}},{"$f":"D118-D122","v":{"v":0,"d":"0.00"}},{"$f":"E118-E122","v":{"v":0,"d":"0.00"}}]
["Biométhane en sortie d'épurateur (CO2)",{"$f":"B124/B121*(1-B121)","v":{"v":0,"d":"0.00"}},{"$f":"B125*massevol_CO2/1000","v":{"v":0,"d":"0.00"}}]
["Consommation de charbon actif (kg)",{"$f":"'BDD modélisation ICV'!B51*'Calculs fonctionnement'!B117/1000","v":{"v":0,"d":"0.00"}}]
["kg eq CO2 20 ans",{"$f":"B126*'BDD export Ecoinvent - SIMAPRO'!W8","v":{"v":0,"d":"0.00"}}]
["kg eq CO2 100 ans",{"$f":"B126*'BDD export Ecoinvent - SIMAPRO'!W9","v":{"v":0,"d":"0.00"}}]
["Ressources fossiles et nucléaires (kWh eq)",{"$f":"B126*'BDD export Ecoinvent - SIMAPRO'!W10","v":{"v":0,"d":"0.00"}}]
["kg CO2 biogénique",{"$f":"C122*(44/16)*1000+C123*1000","v":{"v":0,"d":"0.00"}}]
[]
["Valorisation CO2"]
["Rendement de la valorisation",{"$f":"'Données projet'!B64","v":{"v":0,"d":"0%"}}]
["CO2 total récupéré",{"$f":"B123*B133","v":{"v":0,"d":"0.00"}},{"$f":"B134*massevol_CO2/1000","v":{"v":0,"d":"0.00"}}]
[]
["Poste d'injection"]
["Biométhane en entrée (CH4)",{"$f":"B124*(1-'Données projet'!B69)","v":{"v":0,"d":"0.00"}},{"$f":"B137*massevol_CH4/1000","v":{"v":0,"d":"0.00"}},{"$f":"C137*1000*PCI_CH4","v":{"v":0,"d":"0.00"}},{"$f":"D137/3.6","v":{"v":0,"d":"0.00"}}]
["Biométhane en entrée (CO2)",{"$f":"B125*(1-'Données projet'!B69)","v":{"v":0,"d":"0.00"}},{"$f":"B138*massevol_CO2/1000","v":{"v":0,"d":"0.00"}}]
["% de pertes",{"$f":"'BDD modélisation ICV'!E40","v":{"v":1E-3,"d":"0.10%"}}]
["Pertes de biométhane (CH4)",{"$f":"B137*B139","v":{"v":0,"d":"0.00"}},{"$f":"B140*massevol_CH4/1000","v":{"v":0,"d":"0.00"}},{"$f":"C140*1000*PCI_CH4","v":{"v":0,"d":"0.00"}},{"$f":"D140/3.6","v":{"v":0,"d":"0.00"}}]
["Pertes de biométhane (CO2)",{"$f":"B138*B139","v":{"v":0,"d":"0.00"}},{"$f":"B141*massevol_CO2/1000","v":{"v":0,"d":"0.00"}}]
["Biométhane injecté dans le réseau (CH4)",{"$f":"B137-B140","v":{"v":0,"d":"0.00"}},{"$f":"B142*massevol_CH4/1000","v":{"v":0,"d":"0.00"}},{"$f":"C142*1000*PCI_CH4","v":{"v":0,"d":"0.00"}},{"$f":"D142/3.6","v":{"v":0,"d":"0.00"}}]
["Biométhane injecté dans le réseau (CO2)",{"$f":"B138-B141","v":{"v":0,"d":"0.00"}},{"$f":"B143*massevol_CO2/1000","v":{"v":0,"d":"0.00"}}]
["Quantité de THT consommée",null,{"$f":"(B142+B143)*'BDD modélisation ICV'!B41/1000000","v":{"v":0,"d":"0.00E+00"}}]
["kg eq CO2 20 ans",{"$f":"C140*1000*FC_CH4B20*B121+C144*1000*'BDD export Ecoinvent - SIMAPRO'!U8","v":{"v":0,"d":"0.00"}}]
["kg eq CO2 100 ans",{"$f":"C140*1000*FC_CH4B100*B121+C144*1000*'BDD export Ecoinvent - SIMAPRO'!U9","v":{"v":0,"d":"0.00"}}]
["Ressources fossiles et nucléaires (kWh eq)",{"$f":"C144*1000*'BDD export Ecoinvent - SIMAPRO'!U10","v":{"v":0,"d":"0.00"}}]
["kg CO2 biogénique",{"$f":"C141*1000","v":{"v":0,"d":"0.00"}}]
[]
["Combustion du biométhane en chaudière"]
["Biométhane injecté dans le réseau et brûlé en chaudière (CH4)",{"$f":"B142","v":{"v":0,"d":"0.00"}},{"$f":"B151*massevol_CH4/1000","v":{"v":0,"d":"0.00"}},{"$f":"C151*1000*PCI_CH4","v":{"v":0,"d":"0.00"}},{"$f":"D151/3.6","v":{"v":0,"d":"0.00"}}]
["Biométhane injecté dans le réseau et brûlé en chaudière (CO2)",{"$f":"B143","v":{"v":0,"d":"0.00"}},{"$f":"B152*massevol_CO2/1000","v":{"v":0,"d":"0.00"}}]
["kg eq CO2 20 ans",{"$f":"($C$151+$C$152)*1000*'BDD export Ecoinvent - SIMAPRO'!P8","v":{"v":0,"d":"0.00"}}]
["kg eq CO2 100 ans",{"$f":"($C$151+$C$152)*1000*'BDD export Ecoinvent - SIMAPRO'!P9","v":{"v":0,"d":"0.00"}}]
["Ressources fossiles et nucléaires (kWh eq)",{"$f":"($C$151+$C$152)*1000*'BDD export Ecoinvent - SIMAPRO'!P10","v":{"v":0,"d":"0.00"}}]
["kg CO2 biogénique",{"$f":"C151*(44/16)+C152","v":{"v":0,"d":"0.00"}}]
[]
["Station GNV"]
["Biométhane en entrée (CH4)",{"$f":"B124*'Données projet'!B69","v":{"v":0,"d":"0.00"}},{"$f":"B159*massevol_CH4/1000","v":{"v":0,"d":"0.00"}},{"$f":"C159*1000*PCI_CH4","v":{"v":0,"d":"0.00"}},{"$f":"D159/3.6","v":{"v":0,"d":"0.00"}}]
["Biométhane en entrée (CO2)",{"$f":"B125*'Données projet'!B69","v":{"v":0,"d":"0.00"}},{"$f":"B160*massevol_CO2/1000","v":{"v":0,"d":"0.00"}}]
["% de pertes au remplissage du réservoire et d'imbrûlés dans le moteur",{"$f":"'BDD modélisation ICV'!E42","v":{"v":0.0101,"d":"1.01%"}}]
["Pertes de biométhane (CH4)",{"$f":"B159*B161","v":{"v":0,"d":"0.00"}},{"$f":"B162*massevol_CH4/1000","v":{"v":0,"d":"0.00"}},{"$f":"C162*1000*PCI_CH4","v":{"v":0,"d":"0.00"}},{"$f":"D162/3.6","v":{"v":0,"d":"0.00"}}]
["Pertes de biométhane (CO2)",{"$f":"B160*B161","v":{"v":0,"d":"0.00"}},{"$f":"B163*massevol_CO2/1000","v":{"v":0,"d":"0.00"}}]
["Biométhane injecté en station (CH4)",{"$f":"B159-B162","v":{"v":0,"d":"0.00"}},{"$f":"B164*massevol_CH4/1000","v":{"v":0,"d":"0.00"}},{"$f":"C164*1000*PCI_CH4","v":{"v":0,"d":"0.00"}},{"$f":"D164/3.6","v":{"v":0,"d":"0.00"}}]
["Biométhane injecté en station (CO2)",{"$f":"B160-B163","v":{"v":0,"d":"0.00"}},{"$f":"B165*massevol_CO2/1000","v":{"v":0,"d":"0.00"}}]
["kg eq CO2 20 ans",{"$f":"C162*1000*FC_CH4B20","v":{"v":0,"d":"0.00"}}]
["kg eq CO2 100 ans",{"$f":"C162*1000*FC_CH4B100","v":{"v":0,"d":"0.00"}}]
["kg CO2 biogénique",{"$f":"C163*1000","v":{"v":0,"d":"0.00"}}]
[]
["Combustion de biométhane (autoconsommation dans tracteurs)"]
[null,"Cultures principales",{"$nulls":3},"CIVES"]
["Biométhane utilisé en tracteur",{"$f":"IF('Données projet'!B68=\"oui\",C172/massevol_biométhane*1000,0)","v":{"v":0,"d":"0.00"}},{"$f":"SUMIF('Données projet substrat'!D6:D1884,\"Cultures principales\",'Données projet substrat'!BR6:BR1884)/1000","v":{"v":0,"d":"0.00"}},null,null,{"$f":"IF('Données projet'!B68=\"oui\",G172/massevol_biométhane*1000,0)","v":{"v":0,"d":"0.00"}},{"$f":"SUMIF('Données projet substrat'!D6:D1884,\"CIVE*\",'Données projet substrat'!BR6:BR1884)/1000","v":{"v":0,"d":"0.00"}}]
["dont CH4",{"$f":"B172*0.97","v":{"v":0,"d":"0.00"}},{"$f":"B173*massevol_CH4/1000","v":{"v":0,"d":"0.00"}},{"$f":"C173*1000*PCI_CH4","v":{"v":0,"d":"0.00"}},{"$f":"D173/3.6","v":{"v":0,"d":"0.00"}},{"$f":"F172*0.97","v":{"v":0,"d":"0.00"}},{"$f":"F173*massevol_CH4/1000","v":{"v":0,"d":"0.00"}},{"$f":"G173*1000*PCI_CH4","v":{"v":0,"d":"0.00"}},{"$f":"H173/3.6","v":{"v":0,"d":"0.00"}}]
["dont CO2",{"$f":"B172-B173","v":{"v":0,"d":"0.00"}},{"$f":"B174*massevol_CO2/1000","v":{"v":0,"d":"0.00"}},null,null,{"$f":"F172-F173","v":{"v":0,"d":"0.00"}},{"$f":"F174*massevol_CO2/1000","v":{"v":0,"d":"0.00"}}]
["% de pertes l'injection dans le réservoir et à l'utilisation",{"$f":"'BDD modélisation ICV'!E42","v":{"v":0.0101,"d":"1.01%"}},{"$nulls":3},{"$f":"'BDD modélisation ICV'!E42","v":{"v":0.0101,"d":"1.01%"}}]
["Pertes de CH4",{"$f":"B173*B175","v":{"v":0,"d":"0.00"}},{"$f":"B176*massevol_CH4/1000","v":{"v":0,"d":"0.00"}},{"$f":"C176*1000*PCI_CH4","v":{"v":0,"d":"0.00"}},{"$f":"D176/3.6","v":{"v":0,"d":"0.00"}},{"$f":"F173*F175","v":{"v":0,"d":"0.00"}},{"$f":"F176*massevol_CH4/1000","v":{"v":0,"d":"0.00"}},{"$f":"G176*1000*PCI_CH4","v":{"v":0,"d":"0.00"}},{"$f":"H176/3.6","v":{"v":0,"d":"0.00"}}]
["Pertes de biométhane (C02)",{"$f":"B174*B175","v":{"v":0,"d":"0.00"}},{"$f":"B177*massevol_CO2/1000","v":{"v":0,"d":"0.00"}},null,null,{"$f":"F174*F175","v":{"v":0,"d":"0.00"}},{"$f":"F177*massevol_CO2/1000","v":{"v":0,"d":"0.00"}}]
["CH4 brûlé en moteur",{"$f":"B173-B176","v":{"v":0,"d":"0.00"}},{"$f":"B178*massevol_CH4/1000","v":{"v":0,"d":"0.00"}},{"$f":"C178*1000*PCI_CH4","v":{"v":0,"d":"0.00"}},{"$f":"D178/3.6","v":{"v":0,"d":"0.00"}},{"$f":"F173-F176","v":{"v":0,"d":"0.00"}},{"$f":"F178*massevol_CH4/1000","v":{"v":0,"d":"0.00"}},{"$f":"G178*1000*PCI_CH4","v":{"v":0,"d":"0.00"}},{"$f":"H178/3.6","v":{"v":0,"d":"0.00"}}]
["kg eq CO2 20 ans",{"$f":"C176*1000*FC_CH4B20","v":{"v":0,"d":"0.00"}},{"$nulls":3},{"$f":"G176*1000*FC_CH4B20","v":{"v":0,"d":"0.00"}}]
["kg eq CO2 100 ans",{"$f":"C176*1000*FC_CH4B100","v":{"v":0,"d":"0.00"}},{"$nulls":3},{"$f":"G176*1000*FC_CH4B100","v":{"v":0,"d":"0.00"}}]
["kg CO2 biogénique",{"$f":"C177*1000+C178*1000*44/16","v":{"v":0,"d":"0.00"}},{"$nulls":3},{"$f":"G177*1000+G178*1000*44/16","v":{"v":0,"d":"0.00"}}]
[]
["Combustion de biométhane (véhicules bioGNV)"]
["Biométhane utilisé en GNV",{"$f":"B164+B165-B172-F172","v":{"v":0,"d":"0.00"}},{"$f":"B184*massevol_biométhane/1000","v":{"v":0,"d":"0.00"}}]
["dont CH4",{"$f":"B184*B121","v":{"v":0,"d":"0.00"}},{"$f":"B185*massevol_CH4/1000","v":{"v":0,"d":"0.00"}},{"$f":"C185*1000*PCI_CH4","v":0},{"$f":"D185/3.6","v":{"v":0,"d":"0.00"}}]
["dont CO2",{"$f":"B184*(1-B121)","v":{"v":0,"d":"0.00"}},{"$f":"B186*massevol_CO2/1000","v":{"v":0,"d":"0.00"}}]
["% de pertes l'injection dans le réservoir et à l'utilisation",{"$f":"'BDD modélisation ICV'!E42","v":{"v":0.0101,"d":"1.01%"}}]
["Pertes de biométhane (CH4)",{"$f":"B185*B187","v":{"v":0,"d":"0.00"}},{"$f":"B188*massevol_CH4/1000","v":{"v":0,"d":"0.00"}},{"$f":"C188*1000*PCI_CH4","v":{"v":0,"d":"0.00"}},{"$f":"D188/3.6","v":{"v":0,"d":"0.00"}}]
["Pertes de biométhane (CO2)",{"$f":"B186*B187","v":{"v":0,"d":"0.00"}},{"$f":"B189*massevol_CO2/1000","v":{"v":0,"d":"0.00"}}]
["CH4 brûlé",{"$f":"B185-B188","v":{"v":0,"d":"0.00"}},{"$f":"B190*massevol_CH4/1000","v":{"v":0,"d":"0.00"}},{"$f":"C190*1000*PCI_CH4","v":{"v":0,"d":"0.00"}},{"$f":"D190/3.6","v":{"v":0,"d":"0.00"}}]
["kg eq CO2 20 ans",{"$f":"C188*1000*FC_CH4B20","v":{"v":0,"d":"0.00"}}]
["kg eq CO2 100 ans",{"$f":"C188*1000*FC_CH4B100","v":{"v":0,"d":"0.00"}}]
["kg CO2 biogénique",{"$f":"C189*1000+C190*1000*44/16","v":{"v":0,"d":"0.00"}}]
[]
["Traitement de l'air (consommation d'eau)"]
["Quantité d'air traité (m3)",{"$f":"IF('Données projet'!B25=\"oui\",B83*'BDD modélisation ICV'!B76,0)","v":0}]
["Consommation d'eau (m3)",{"$f":"B196*'BDD modélisation ICV'!B77","v":{"v":0,"d":"0.00"}}]
["kg eq CO2 20 ans",{"$f":"$B$197*'BDD export Ecoinvent - SIMAPRO'!T8","v":{"v":0,"d":"0.00"}}]
["kg eq CO2 100 ans",{"$f":"$B$197*'BDD export Ecoinvent - SIMAPRO'!T9","v":{"v":0,"d":"0.00"}}]
["Ressources fossiles et nucléaires (kWh eq)",{"$f":"$B$197*'BDD export Ecoinvent - SIMAPRO'!T10","v":{"v":0,"d":"0.00"}}]
[]
["6. Flux d'énergie secondaire",null,null,"Consommation de biométhane par les cultures"]
[]
[null,"Electrique",{"$nulls":9},"Thermique"]
[null,"Broyage","Digestion","Traitement de l'air","Presse à vis","Centrifugeuse","Epuration","Capture et liquéfaction CO2","Injection dans le réseau","Injection en station bioGNV","Auxiliaires (en cas d'installation en cogé)","Hygiénisation","Chauffage digesteur"]
["Consommation unitaire",{"$f":"'BDD modélisation ICV'!B4","v":8},{"$f":"IF('Données projet'!B9=\"cogénération\",'BDD modélisation ICV'!B61,'BDD modélisation ICV'!B44)","v":0.49},{"$f":"'BDD modélisation ICV'!B78","v":1E-3},{"$f":"'BDD modélisation ICV'!B7","v":0.6},{"$f":"'BDD modélisation ICV'!B8","v":1.2},{"$f":"'BDD modélisation ICV'!B39","v":0.35},{"$f":"'BDD modélisation ICV'!B43","v":0.35},{"$f":"'BDD modélisation ICV'!B40","v":0.12},{"$f":"'BDD modélisation ICV'!B42","v":0.267},{"$f":"'BDD modélisation ICV'!D59","v":{"v":0.045,"d":"4.5%"}},{"$f":"'BDD modélisation ICV'!C5","v":170},{"$f":"IF('Données projet'!B9=\"cogénération\",'Données projet'!B72,'BDD modélisation ICV'!B34)","v":{"v":0.06,"d":"6%"}}]
["Unité","kWhe/t de matière entrante","kWhe/Nm3 de CH4 produit","kWh/Nm3 d'air traité","kWhe/t de matière entrante","kWhe/t de matière entrante","kWhe/Nm3 de gaz entrant","kWhe/kg CO2 valorisé","kWhe/Nm3 de gaz entrant","kWhe/kg GNV","% de kWh produits","kWht/t de matière entrante","% de kWh"]
["Quantité entrante",{"$f":"'Données projet substrat'!T4","v":{"v":0,"d":"0.0"}},{"$f":"B80","v":{"v":0,"d":"0.00"}},{"$f":"B196","v":{"v":0,"d":"0.00"}},{"$f":"I5","v":{"v":0,"d":"0.0"}},{"$f":"IF('Données projet'!B87=\"centrifugeuse\",I5,0)","v":{"v":0,"d":"0.0"}},{"$f":"B117","v":{"v":0,"d":"0.00"}},{"$f":"C134","v":{"v":0,"d":"0.00"}},{"$f":"B124+B125","v":{"v":0,"d":"0.00"}},{"$f":"(C164+C165)*1000","v":{"v":0,"d":"0.00"}},{"$f":"IF(B230=0,C230*1000,B230*1000)","v":{"v":0,"d":"0.00"}},{"$f":"'Données projet substrat'!U4","v":{"v":0,"d":"0.0"}},{"$f":"IF('Données projet'!B9=\"cogénération\",B231*1000,E124)","v":{"v":0,"d":"0.0"}}]
["Consommation théorique (kWh)",{"$f":"B206*B208","v":{"v":0,"d":"0.00"}},{"$f":"C206*C208","v":{"v":0,"d":"0.00"}},{"$f":"D206*D208","v":{"v":0,"d":"0.00"}},{"$f":"E206*E208","v":{"v":0,"d":"0.00"}},{"v":0,"d":"0.00"},{"$f":"G206*G208","v":{"v":0,"d":"0.00"}},{"v":0,"d":"0.00"},{"$f":"I206*I208","v":{"v":0,"d":"0.00"}},{"v":0,"d":"0.00"},{"$f":"K206*K208","v":{"v":0,"d":"0.00"}},{"$f":"L206*L208","v":{"v":0,"d":"0.00"}},{"$f":"M206*M208","v":{"v":0,"d":"0.00"}}]
["Cas déclaré: 0=à ne pas prendre en compte; 1=à prendre en compte",{"$f":"IF('Données projet'!B37=\"oui\",0,1)","v":1},0,0,{"$f":"IF('Données projet'!B87=\"presse à vis\",IF('Données projet'!B38=\"Oui\",0,1),0)","v":0},{"$f":"IF('Données projet'!B87=\"centrifugeuse\",IF('Données projet'!B38=\"Oui\",0,1),0)","v":0},0,0,0,0,0,{"$f":"IF('Données projet'!B52=\"Oui\",0,1)","v":1},0,"comprend chauffage par défaut"]
["Cas calculé: 0=à ne pas prendre en compte; 1=à prendre en compte",1,1,{"$f":"IF('Données projet'!B25=\"Oui\",1,0)","v":0},{"$f":"IF('Données projet'!B87=\"presse à vis\",1,0)","v":0},{"$f":"IF('Données projet'!B87=\"centrifugeuse\",1,0)","v":0},{"$f":"IF('Données projet'!B9=\"Epuration/injection\",1,IF('Données projet'!B56=\"oui\",1,0))","v":0},{"$f":"IF('Données projet'!B63=\"Oui\",1,0)","v":0},{"$f":"IF('Données projet'!B9=\"Epuration/injection\",1,IF('Données projet'!B56=\"oui\",1,0))","v":0},{"$f":"IF('Données projet'!B68=\"Oui\",1,0)","v":0},{"$f":"IF('Données projet'!B9=\"cogénération\",1,0)","v":0},1,1]
["kg eq CO2 20 ans",{"$f":"B209*('Données projet'!$B$29*'BDD export Ecoinvent - SIMAPRO'!$R$8+'Données projet'!$B$35*'BDD export Ecoinvent - SIMAPRO'!$S$8)","v":{"v":0,"d":"0.00"}},{"$f":"C209*('Données projet'!$B$29*'BDD export Ecoinvent - SIMAPRO'!$R$8+'Données projet'!$B$35*'BDD export Ecoinvent - SIMAPRO'!$S$8)","v":{"v":0,"d":"0.00"}},{"$f":"D209*('Données projet'!$B$29*'BDD export Ecoinvent - SIMAPRO'!$R$8+'Données projet'!$B$35*'BDD export Ecoinvent - SIMAPRO'!$S$8)","v":{"v":0,"d":"0.00"}},{"$f":"E209*('Données projet'!$B$29*'BDD export Ecoinvent - SIMAPRO'!$R$8+'Données projet'!$B$35*'BDD export Ecoinvent - SIMAPRO'!$S$8)","v":{"v":0,"d":"0.00"}},{"$f":"F209*('Données projet'!$B$29*'BDD export Ecoinvent - SIMAPRO'!$R$8+'Données projet'!$B$35*'BDD export Ecoinvent - SIMAPRO'!$S$8)","v":{"v":0,"d":"0.00"}},{"$f":"G209*('Données projet'!$B$29*'BDD export Ecoinvent - SIMAPRO'!$R$8+'Données projet'!$B$35*'BDD export Ecoinvent - SIMAPRO'!$S$8)","v":{"v":0,"d":"0.00"}},{"$f":"H209*('Données projet'!$B$29*'BDD export Ecoinvent - SIMAPRO'!$R$8+'Données projet'!$B$35*'BDD export Ecoinvent - SIMAPRO'!$S$8)","v":{"v":0,"d":"0.00"}},{"$f":"I209*('Données projet'!$B$29*'BDD export Ecoinvent - SIMAPRO'!$R$8+'Données projet'!$B$35*'BDD export Ecoinvent - SIMAPRO'!$S$8)","v":{"v":0,"d":"0.00"}},{"$f":"J209*('Données projet'!$B$29*'BDD export Ecoinvent - SIMAPRO'!$R$8+'Données projet'!$B$35*'BDD export Ecoinvent - SIMAPRO'!$S$8)","v":{"v":0,"d":"0.00"}},{"$f":"K209*('Données projet'!$B$29*'BDD export Ecoinvent - SIMAPRO'!$R$8+'Données projet'!$B$35*'BDD export Ecoinvent - SIMAPRO'!$S$8)","v":{"v":0,"d":"0.00"}},{"$f":"L209*'Données projet'!$B$41*'BDD export Ecoinvent - SIMAPRO'!$N$8","v":{"v":0,"d":"0.00"}},{"$f":"IF('Données projet'!B9=\"cogénération\",0,IF('Données projet'!B59=\"oui\",0,M209*'Données projet'!B41*'BDD export Ecoinvent - SIMAPRO'!N8))","v":{"v":0,"d":"0.00"}}]
["kg eq CO2 100 ans",{"$f":"B209*('Données projet'!$B$29*'BDD export Ecoinvent - SIMAPRO'!$R$9+'Données projet'!$B$35*'BDD export Ecoinvent - SIMAPRO'!$S$9)","v":{"v":0,"d":"0.00"}},{"$f":"C209*('Données projet'!$B$29*'BDD export Ecoinvent - SIMAPRO'!$R$9+'Données projet'!$B$35*'BDD export Ecoinvent - SIMAPRO'!$S$9)","v":{"v":0,"d":"0.00"}},{"$f":"D209*('Données projet'!$B$29*'BDD export Ecoinvent - SIMAPRO'!$R$9+'Données projet'!$B$35*'BDD export Ecoinvent - SIMAPRO'!$S$9)","v":{"v":0,"d":"0.00"}},{"$f":"E209*('Données projet'!$B$29*'BDD export Ecoinvent - SIMAPRO'!$R$9+'Données projet'!$B$35*'BDD export Ecoinvent - SIMAPRO'!$S$9)","v":{"v":0,"d":"0.00"}},{"$f":"F209*('Données projet'!$B$29*'BDD export Ecoinvent - SIMAPRO'!$R$9+'Données projet'!$B$35*'BDD export Ecoinvent - SIMAPRO'!$S$9)","v":{"v":0,"d":"0.00"}},{"$f":"G209*('Données projet'!$B$29*'BDD export Ecoinvent - SIMAPRO'!$R$9+'Données projet'!$B$35*'BDD export Ecoinvent - SIMAPRO'!$S$9)","v":{"v":0,"d":"0.00"}},{"$f":"H209*('Données projet'!$B$29*'BDD export Ecoinvent - SIMAPRO'!$R$9+'Données projet'!$B$35*'BDD export Ecoinvent - SIMAPRO'!$S$9)","v":{"v":0,"d":"0.00"}},{"$f":"I209*('Données projet'!$B$29*'BDD export Ecoinvent - SIMAPRO'!$R$9+'Données projet'!$B$35*'BDD export Ecoinvent - SIMAPRO'!$S$9)","v":{"v":0,"d":"0.00"}},{"$f":"J209*('Données projet'!$B$29*'BDD export Ecoinvent - SIMAPRO'!$R$9+'Données projet'!$B$35*'BDD export Ecoinvent - SIMAPRO'!$S$9)","v":{"v":0,"d":"0.00"}},{"$f":"K209*('Données projet'!$B$29*'BDD export Ecoinvent - SIMAPRO'!$R$9+'Données projet'!$B$35*'BDD export Ecoinvent - SIMAPRO'!$S$9)","v":{"v":0,"d":"0.00"}},{"$f":"L209*'Données projet'!$B$41*'BDD export Ecoinvent - SIMAPRO'!$N$9","v":{"v":0,"d":"0.00"}},{"$f":"IF('Données projet'!B9=\"cogénération\",0,IF('Données projet'!B59=\"oui\",0,M209*'Données projet'!B41*'BDD export Ecoinvent - SIMAPRO'!N9))","v":{"v":0,"d":"0.00"}}]
["Ressources fossiles et nucléaires (kWh eq)",{"$f":"B209*('Données projet'!$B$29*'BDD export Ecoinvent - SIMAPRO'!$R$10+'Données projet'!$B$35*'BDD export Ecoinvent - SIMAPRO'!$S$10)","v":{"v":0,"d":"0.00"}},{"$f":"C209*('Données projet'!$B$29*'BDD export Ecoinvent - SIMAPRO'!$R$10+'Données projet'!$B$35*'BDD export Ecoinvent - SIMAPRO'!$S$10)","v":{"v":0,"d":"0.00"}},{"$f":"D209*('Données projet'!$B$29*'BDD export Ecoinvent - SIMAPRO'!$R$10+'Données projet'!$B$35*'BDD export Ecoinvent - SIMAPRO'!$S$10)","v":{"v":0,"d":"0.00"}},{"$f":"E209*('Données projet'!$B$29*'BDD export Ecoinvent - SIMAPRO'!$R$10+'Données projet'!$B$35*'BDD export Ecoinvent - SIMAPRO'!$S$10)","v":{"v":0,"d":"0.00"}},{"$f":"F209*('Données projet'!$B$29*'BDD export Ecoinvent - SIMAPRO'!$R$10+'Données projet'!$B$35*'BDD export Ecoinvent - SIMAPRO'!$S$10)","v":{"v":0,"d":"0.00"}},{"$f":"G209*('Données projet'!$B$29*'BDD export Ecoinvent - SIMAPRO'!$R$10+'Données projet'!$B$35*'BDD export Ecoinvent - SIMAPRO'!$S$10)","v":{"v":0,"d":"0.00"}},{"$f":"H209*('Données projet'!$B$29*'BDD export Ecoinvent - SIMAPRO'!$R$10+'Données projet'!$B$35*'BDD export Ecoinvent - SIMAPRO'!$S$10)","v":{"v":0,"d":"0.00"}},{"$f":"I209*('Données projet'!$B$29*'BDD export Ecoinvent - SIMAPRO'!$R$10+'Données projet'!$B$35*'BDD export Ecoinvent - SIMAPRO'!$S$10)","v":{"v":0,"d":"0.00"}},{"$f":"J209*('Données projet'!$B$29*'BDD export Ecoinvent - SIMAPRO'!$R$10+'Données projet'!$B$35*'BDD export Ecoinvent - SIMAPRO'!$S$10)","v":{"v":0,"d":"0.00"}},{"$f":"K209*('Données projet'!$B$29*'BDD export Ecoinvent - SIMAPRO'!$R$10+'Données projet'!$B$35*'BDD export Ecoinvent - SIMAPRO'!$S$10)","v":{"v":0,"d":"0.00"}},{"$f":"L209*'Données projet'!$B$41*'BDD export Ecoinvent - SIMAPRO'!$N$10","v":{"v":0,"d":"0.00"}},{"$f":"IF('Données projet'!B9=\"cogénération\",0,IF('Données projet'!B59=\"oui\",0,M209*'Données projet'!B41*'BDD export Ecoinvent - SIMAPRO'!N10))","v":{"v":0,"d":"0.00"}}]
[]
["Consommations de l'installation (en cogénération ou en épuration/injection)"]
["Paramètres"]
["Electricité (consommation)",{"$f":"IF('Données projet'!B36=0,0,1)","v":0},{"$f":"1-B218","v":1}]
["Chaleur (consommation)",{"$f":"IF('Données projet'!B51=0,0,1)","v":0},{"$f":"1-B219","v":1}]
["Electricité (production)",{"$f":"IF('Valorisation du biogaz'!D21=0,0,1)","v":0},{"$f":"1-B220","v":1}]
["Chaleur (production)",{"$f":"IF('Valorisation du biogaz'!D24=0,0,1)","v":0},{"$f":"1-B221","v":1}]
["Biométhane (production)",{"$f":"IF('Valorisation du biogaz'!D28=0,0,1)","v":0},{"$f":"1-B222","v":1}]
[]
[null,"Déclaré","Calculé",null,"COMMENTAIRES"]
[null,"MWh","MWh"]
["Production de biométhane (injection réseau)",{"$f":"IF('Données projet'!B9=\"Epuration/injection\",'Données projet'!B67*(1-'Données projet'!B69),0)","v":{"v":0,"d":"0.00"}},{"$f":"IF('Données projet'!B9=\"Epuration/injection\",E142/1000,0)","v":{"v":0,"d":"0.00"}},"Si épuration/injection"]
["Production de bioGNV",{"$f":"IF('Données projet'!B9=\"Epuration/injection\",'Données projet'!B67*'Données projet'!B69,0)","v":{"v":0,"d":"0.00"}},{"$f":"IF('Données projet'!B9=\"Epuration/injection\",E164/1000,0)","v":{"v":0,"d":"0.00"}}]
["Autoconsommation bioGNV",{"$f":"IF('Données projet'!B9=\"Epuration/injection\",(E173+I173+B63*'BDD modélisation ICV'!A177*'BDD modélisation ICV'!G138)/1000,0)","v":{"v":0,"d":"0.00"}},{"$f":"IF('Données projet'!B9=\"Epuration/injection\",(E173+I173+B63*'BDD modélisation ICV'!A177*'BDD modélisation ICV'!G138)/1000,0)","v":{"v":0,"d":"0.00"}}]
["Production bioGNV exédentaire",{"$f":"IF(B227-B228<0,0,B227-B228)","v":{"v":0,"d":"0.00"}},{"$f":"IF(C227-C228<0,0,C227-C228)","v":{"v":0,"d":"0.00"}},null,{"$f":"IF(B222=1,B227-B228,C227-C228)","v":{"v":0,"d":"0.00"}},"si négatif alors mettre un message d'alerte dans les résultats \"tableau de bord\" (cellule N19)"]
["Production électrique brute",{"$f":"'Données projet'!B65","v":{"v":0,"d":"0.00"}},{"$f":"IF('Données projet'!B9=\"cogénération\",'Données projet'!B53*E106/1000,'Données projet'!B53*E115/1000)","v":{"v":0,"d":"0.00"}},"Si présence cogé"]
["Production thermique brute",{"$f":"'Données projet'!B66","v":{"v":0,"d":"0.00"}},{"$f":"IF('Données projet'!B9=\"cogénération\",'Données projet'!B54*E106/1000,'Données projet'!B54*E115/1000)","v":{"v":0,"d":"0.00"}}]
["Consommations électriques",{"$f":"'Données projet'!B36+(SUMPRODUCT(B209:K209,B210:K210)/1000)","v":{"v":0,"d":"0.00"}},{"$f":"SUMPRODUCT(B209:K209,B211:K211)/1000","v":{"v":0,"d":"0.00"}}]
["Consommations thermiques",{"$f":"'Données projet'!B51+(SUMPRODUCT(L209:M209,L210:M210)/1000)","v":{"v":0,"d":"0.00"}},{"$f":"SUMPRODUCT(L209:M209,L211:M211)/1000","v":{"v":0,"d":"0.00"}}]
["Autoconsommation électrique",{"$f":"'Données projet'!B31","v":{"v":0,"d":"0.00"}},{"$f":"'Données projet'!B70*C230","v":{"v":0,"d":"0.00"}}]
["Autoconsommation thermique",{"$f":"'Données projet'!B43","v":{"v":0,"d":"0.00"}},{"$f":"'Données projet'!B72*C231","v":{"v":0,"d":"0.00"}}]
["Electricité vendue",{"$f":"'Données projet'!B71*B230","v":{"v":0,"d":"0.00"}},{"$f":"'Données projet'!B71*C230","v":{"v":0,"d":"0.00"}}]
["Chaleur vendue",{"$f":"B231*'Données projet'!B73","v":{"v":0,"d":"0.00"}},{"$f":"C231*'Données projet'!B73","v":{"v":0,"d":"0.00"}}]
["kg eq CO2 20 ans",{"$f":"B232*1000*('Données projet'!$B$29*'BDD export Ecoinvent - SIMAPRO'!$R$8+'Données projet'!$B$35*'BDD export Ecoinvent - SIMAPRO'!$S$8)+B233*1000*('Données projet'!$B$41*'BDD export Ecoinvent - SIMAPRO'!$M$8)","v":{"v":0,"d":"0.00"}},{"$f":"SUMPRODUCT(B211:M211,B212:M212)","v":{"v":0,"d":"0.00"}}]
["kg eq CO2 100 ans",{"$f":"B232*1000*('Données projet'!$B$29*'BDD export Ecoinvent - SIMAPRO'!$R$9+'Données projet'!$B$35*'BDD export Ecoinvent - SIMAPRO'!$S$9)+B233*1000*('Données projet'!$B$41*'BDD export Ecoinvent - SIMAPRO'!$M$9)","v":{"v":0,"d":"0.00"}},{"$f":"SUMPRODUCT(B211:M211,B213:M213)","v":{"v":0,"d":"0.00"}}]
["Ressources fossiles et nucléaires (kWh eq)",{"$f":"B232*1000*('Données projet'!$B$29*'BDD export Ecoinvent - SIMAPRO'!$R$10+'Données projet'!$B$35*'BDD export Ecoinvent - SIMAPRO'!$S$10)+B233*1000*('Données projet'!$B$41*'BDD export Ecoinvent - SIMAPRO'!$M$10)","v":{"v":0,"d":"0.00"}},{"$f":"SUMPRODUCT(B211:M211,B214:M214)","v":{"v":0,"d":"0.00"}}]
[]
["7. Substitutions (émissions évitées grâce à la méthanisation)"]
["Substitution à la consommation de diesel des CIPAN"]
["Substitution de diesel (kg)",{"$f":"'Données projet substrat'!BF4","v":{"v":0,"d":"0.00"}}]
["kg eq CO2 20 ans",{"$f":"$B$244*('BDD export Ecoinvent - SIMAPRO'!D8+'BDD export Ecoinvent - SIMAPRO'!E8)","v":{"v":0,"d":"0.00"}}]
["kg eq CO2 100 ans",{"$f":"$B$244*('BDD export Ecoinvent - SIMAPRO'!D9+'BDD export Ecoinvent - SIMAPRO'!E9)","v":{"v":0,"d":"0.00"}}]
["Ressources fossiles et nucléaires (kWh eq)",{"$f":"$B$244*('BDD export Ecoinvent - SIMAPRO'!D10+'BDD export Ecoinvent - SIMAPRO'!E10)","v":{"v":0,"d":"0.00"}}]
["Substitution aux traitements de déchets"]
["kg eq CO2 20 ans",{"$f":"'Données projet substrat'!CP4","v":{"v":0,"d":"0.00"}}]
["kg eq CO2 100 ans",{"$f":"'Données projet substrat'!CQ4","v":{"v":0,"d":"0.00"}}]
["Ressources fossiles et nucléaires (kWh eq)",{"$f":"'Données projet substrat'!CR4","v":{"v":0,"d":"0.00"}}]
["Substitution de t.km",{"$f":"'Données projet substrat'!CK4","v":{"v":0,"d":"0.00"}}]
["kg eq CO2 20 ans",{"$f":"B252*'BDD export Ecoinvent - SIMAPRO'!F8","v":{"v":0,"d":"0.00"}}]
["kg eq CO2 100 ans",{"$f":"B252*'BDD export Ecoinvent - SIMAPRO'!F9","v":{"v":0,"d":"0.00"}}]
["Ressources fossiles et nucléaires (kWh eq)",{"$f":"B252*'BDD export Ecoinvent - SIMAPRO'!F10","v":{"v":0,"d":"0.00"}}]
["Substitution de CO2"]
["Substitution de t.km",{"$f":"C134*500","v":{"v":0,"d":"0.00"}},"base de 500km évités"]
["kg eq CO2 20 ans",{"$f":"B257*'BDD export Ecoinvent - SIMAPRO'!F8","v":{"v":0,"d":"0.00"}}]
["kg eq CO2 100 ans",{"$f":"B257*'BDD export Ecoinvent - SIMAPRO'!F9","v":{"v":0,"d":"0.00"}}]
["Ressources fossiles et nucléaires (kWh eq)",{"$f":"B257*'BDD export Ecoinvent - SIMAPRO'!F10","v":{"v":0,"d":"0.00"}}]
["Substitution d'énergie"]
["Substitution à la production de gaz (injection réseau de biométhane) (kg)",{"$f":"B222*B226*'BDD modélisation ICV'!A158+C222*(C151+C152)*1000","v":{"v":0,"d":"0.00"}},"GN"]
["Substitution à la production de diesel (injection station de bioGNV) (kg)",{"$f":"B222*B229*'BDD modélisation ICV'!A158+C222*C184*1000","v":{"v":0,"d":"0.00"}},"carburant pétro-sourcé (diesel), hors utilisation dans le tracteur (\"autoconsommation\")"]
["kg eq CO2 20 ans",{"$f":"B262*'BDD export Ecoinvent - SIMAPRO'!N8+B263*('BDD export Ecoinvent - SIMAPRO'!E8+'BDD export Ecoinvent - SIMAPRO'!D8)","v":{"v":0,"d":"0.00"}}]
["kg eq CO2 100 ans",{"$f":"B262*'BDD export Ecoinvent - SIMAPRO'!N9+B263*('BDD export Ecoinvent - SIMAPRO'!E9+'BDD export Ecoinvent - SIMAPRO'!D9)","v":{"v":0,"d":"0.00"}}]
["Ressources fossiles et nucléaires (kWh eq)",{"$f":"B262*'BDD export Ecoinvent - SIMAPRO'!N10+B263*('BDD export Ecoinvent - SIMAPRO'!E10+'BDD export Ecoinvent - SIMAPRO'!D10)","v":{"v":0,"d":"0.00"}}]
["Substitution à la production d'électricité (kWh)",{"$f":"B220*B236*1000+C220*C236*1000","v":{"v":0,"d":"0.00"}},"mix électrique français (high voltage)"]
["kg eq CO2 20 ans",{"$f":"B267*'BDD export Ecoinvent - SIMAPRO'!Q8","v":{"v":0,"d":"0.00"}}]
["kg eq CO2 100 ans",{"$f":"B267*'BDD export Ecoinvent - SIMAPRO'!Q9","v":{"v":0,"d":"0.00"}}]
["Ressources fossiles et nucléaires (kWh eq)",{"$f":"B267*'BDD export Ecoinvent - SIMAPRO'!Q10","v":{"v":0,"d":"0.00"}}]
["Substitution à la production de chaleur (kWh)",{"$f":"B221*B237*1000+C221*C237*1000","v":{"v":0,"d":"0.00"}},"GN"]
["kg eq CO2 20 ans",{"$f":"B271*'BDD export Ecoinvent - SIMAPRO'!M8","v":{"v":0,"d":"0.00"}}]
["kg eq CO2 100 ans",{"$f":"B271*'BDD export Ecoinvent - SIMAPRO'!M9","v":{"v":0,"d":"0.00"}}]
["Ressources fossiles et nucléaires (kWh eq)",{"$f":"B271*'BDD export Ecoinvent - SIMAPRO'!M10","v":{"v":0,"d":"0.00"}}]
["Substitution d'engrais"]
[null,"N (kg) - exporté par le digestat et capté par les légumineuses cultivées en mélange de CIVES","P2O5 (kg) - exporté","K2O (kg) - exporté"]
["kg d'équivalent fertilisant évité production",{"$f":"SUM(Z22:AB22)+'Données projet substrat'!CA4","v":{"v":0,"d":"0.00"}},{"$f":"SUM(Z22:AB22)","v":0},{"$f":"SUM(Z23:AB23)","v":0}]
["kg eq CO2 20 ans",{"$f":"B277*'BDD export Ecoinvent - SIMAPRO'!$G$8","v":0},{"$f":"C277*'BDD export Ecoinvent - SIMAPRO'!$H$8","v":0},{"$f":"D277*'BDD export Ecoinvent - SIMAPRO'!$I$8","v":0}]
["kg eq CO2 100 ans",{"$f":"B278*'BDD export Ecoinvent - SIMAPRO'!$G$9","v":0},{"$f":"C278*'BDD export Ecoinvent - SIMAPRO'!$H$9","v":0},{"$f":"D278*'BDD export Ecoinvent - SIMAPRO'!$I$9","v":0}]
["Ressources fossiles et nucléaires (kWh eq)",{"$f":"B279*'BDD export Ecoinvent - SIMAPRO'!$G$10","v":0},{"$f":"C279*'BDD export Ecoinvent - SIMAPRO'!$H$10","v":0},{"$f":"D279*'BDD export Ecoinvent - SIMAPRO'!$I$10","v":0}]
[]
["Emissions de NH3 et NOx (IPCC, 2019)",{"$f":"B277*'BDD modélisation ICV'!$E$109","v":0}]
["Emissions de N2O indirect (via NH3 et Nox)",{"$f":"B282*'BDD modélisation ICV'!$E$110","v":0}]
[]
["Lessivage de N-NO3-",{"$f":"B277*'BDD modélisation ICV'!$E$111","v":0}]
["Emissions de N-N2O indirect (via NO3-)",{"$f":"B285*'BDD modélisation ICV'!$E$112","v":0}]
[]
["Emissions directes de N-N2O",{"$f":"B277*'BDD modélisation ICV'!$E$113","v":0}]
[]
["Emissions totales de N-N2O",{"$f":"B283+B286+B288","v":0}]
["kg eq CO2 20 ans",{"$f":"B290/28*44*FC_N2O20","v":0}]
["kg eq CO2 100 ans",{"$f":"B290/28*44*FC_N2O100","v":0}]
[]
[]
["Nombre d'hectare fertilisé en azote à une dose de 170 UN / ha",{"$f":"B277/170","v":0}]
["L de diesel non consommé pour l'azote minéral",{"$f":"B295*'BDD ITK culture'!$I$13","v":0}]
["kg de diesel non consommé pour l'azote minéral",{"$f":"B296*'BDD modélisation ICV'!$A$135","v":0}]
["kg eq CO2 20 ans",{"$f":"B297*('BDD export Ecoinvent - SIMAPRO'!$D$8+'BDD export Ecoinvent - SIMAPRO'!$E$8)","v":0}]
["kg eq CO2 100 ans",{"$f":"B297*('BDD export Ecoinvent - SIMAPRO'!$D$9+'BDD export Ecoinvent - SIMAPRO'!$E$9)","v":0}]
["Ressources fossiles et nucléaires (kWh eq)",{"$f":"B297*('BDD export Ecoinvent - SIMAPRO'!$D$10+'BDD export Ecoinvent - SIMAPRO'!$E$10)","v":0}]
[]
["Total des substitutions d'engrais minéraux (avec émissions à l'épandage et travail au champ)"]
["kg eq CO2 20 ans",{"$f":"SUM(B278:D278+B291+B298)","v":0}]
["kg eq CO2 100 ans",{"$f":"SUM(B279:D279+B292+B299)","v":0}]
["Ressources fossiles et nucléaires (kWh eq)",{"$f":"SUM(B280:D280+B300)","v":0}]
[]
["Résultats azote"]
["Catégories","Tonnes d'azote total /an"]
["Lisier",{"$f":"SUMIF('Données projet substrat'!$F$6:$F$14,A309,'Données projet substrat'!$AR$6:$AR$14)/1000","v":{"v":0,"d":"0.00"}}]
["Fumier",{"$f":"SUMIF('Données projet substrat'!$F$6:$F$14,A310,'Données projet substrat'!$AR$6:$AR$14)/1000","v":{"v":0,"d":"0.00"}}]
["Cultures dédiées",{"$f":"SUMIF('Données projet substrat'!$F$6:$F$14,A311,'Données projet substrat'!$AR$6:$AR$14)/1000","v":{"v":0,"d":"0.00"}}]
["CIVES",{"$f":"SUMIF('Données projet substrat'!$F$6:$F$14,A312,'Données projet substrat'!$AR$6:$AR$14)/1000","v":{"v":0,"d":"0.00"}}]
["Déchets/Résidus de cultures/Cultures dédiées déclassées",{"$f":"SUMIF('Données projet substrat'!$F$6:$F$14,A313,'Données projet substrat'!$AR$6:$AR$14)/1000","v":{"v":0,"d":"0.00"}}]
["Déchets/Résidus de collectivité",{"$f":"SUMIF('Données projet substrat'!$F$6:$F$14,A314,'Données projet substrat'!$AR$6:$AR$14)/1000","v":{"v":0,"d":"0.00"}}]
["Déchets de STEU",{"$f":"SUMIF('Données projet substrat'!$F$6:$F$14,A315,'Données projet substrat'!$AR$6:$AR$14)/1000","v":{"v":0,"d":"0.00"}}]
["Déchets d'industrie (IAA animales)",{"$f":"SUMIF('Données projet substrat'!$F$6:$F$14,A316,'Données projet substrat'!$AR$6:$AR$14)/1000","v":{"v":0,"d":"0.00"}}]
["Déchets d'industrie (IAA végétales)",{"$f":"SUMIF('Données projet substrat'!$F$6:$F$14,A317,'Données projet substrat'!$AR$6:$AR$14)/1000","v":{"v":0,"d":"0.00"}}]
["Déchets d'industrie (IAA autres)",{"$f":"SUMIF('Données projet substrat'!$F$6:$F$14,A318,'Données projet substrat'!$AR$6:$AR$14)/1000","v":{"v":0,"d":"0.00"}}]
["Total",{"$f":"SUM(B309:B318)","v":{"v":0,"d":"0.00"}}]
[null,"Tonnes d'UN/an"]
["Part d'azote minéralisé et valorisé sur des cultures principales",{"$f":"SUMIF('Données projet substrat'!$D$6:$D$14,\"Culture principale\",'Données projet substrat'!$CD$6:$CD$14)/1000","v":{"v":0,"d":"0.00"}}]
["Part d'azote minéralisé et valorisé sur des CIVE",{"$f":"SUMIF('Données projet substrat'!$D$6:$D$14,\"CIVE*\",'Données projet substrat'!$CD$6:$CD$14)/1000","v":{"v":0,"d":"0.00"}}]
["Part d'azote minéralisé et exporté",{"$f":"SUM('Calculs fonctionnement'!Z22:AB22)/1000","v":{"v":0,"d":"0.00"}}]
["Part d'azote organique épandu mais non minéralisé",{"$f":"(U7-Z7)/1000","v":{"v":0,"d":"0.00"}}]
["Part émise sous forme de NH3",{"$f":"U25/1000","v":{"v":0,"d":"0.00"}}]
["Part émise sous forme de N2O",{"$f":"U26/1000","v":{"v":0,"d":"0.00"}}]
["Part émise sous forme de NO3-",{"$f":"U27/1000","v":{"v":0,"d":"0.00"}}]
["Total",{"$f":"SUM(B321:B327)","v":{"v":0,"d":"0.00"}}]
["Calcul EV = énergie produite/énergie primaire"]
[{"$f":"(B220*(B230-B234)+C220*(C230-C234)+B222*B226+C222*C226+B221*(B231-B235)+C221*(C231-C235)+B222*B229+C222*C229)","v":{"v":0,"d":"0.00"}},{"$f":"IF(A330/A331>1,1,A330/A331)","v":{"$error":"#DIV/0!"}}]
[{"$f":"E80/1000","v":0}]
[]
["TRE = énergie vendue / énergie consommée"]
[{"$f":"B222*(B226+B229)+B220*(B230-B234)+B221*(B231-B235)+C222*(C226+C229)+C220*(C230-C234)+C221*(C231-C235)","v":{"v":0,"d":"0.00"}},{"$f":"A334/A335","v":{"$error":"#DIV/0!"}}]
[{"$f":"B218*B232*('Données projet'!$B$29*'BDD export Ecoinvent - SIMAPRO'!$R$10+'Données projet'!$B$35*'BDD export Ecoinvent - SIMAPRO'!$S$10)+B219*B233*'Données projet'!$B$41*'BDD export Ecoinvent - SIMAPRO'!$M$10+C218*C232*('Données projet'!$B$29*'BDD export Ecoinvent - SIMAPRO'!$R$10+'Données projet'!$B$35*'BDD export Ecoinvent - SIMAPRO'!$S$10)+C219*C233*'Données projet'!$B$41*'BDD export Ecoinvent - SIMAPRO'!$M$10+B228*B222+C228*C222+(B36+C36+B43+C43+B56+C56+B62+B200+F88)/1000","v":0}]

{"sheet":"Calcul delta","index":14,"n_rows":335,"n_cols":28,"rows_kept":335,"hidden":true,"merged":[[169,0,169,8],[170,1,170,4],[170,5,170,8],[203,1,203,10],[203,11,203,12],[216,0,216,2],[225,3,228,3]]}
["Calculs de fonctionnement"]
[]
["1. Caractérisation du mélange de substrat/ du digestat",{"$nulls":7},"si séparation"]
[null,"Entrée Digesteur","Teneur Entrée Digesteur (kg/t MB)","Sortie Digesteur (brut)","Teneur Sortie Digesteur (kg/t MB)","Evolution de la composition en absolue","Taux de capture en phase solide","Part du digestat brut non séparé (avant recirculation)","Envoi digestat brut en séparation","Digestat phase liquide avant recirculation","Phase liquide recirculée","Entrée stockage digestat brut avec recirculation","Entrée stockage digestat phase liquide","Entrée stockage digestat phase solide",null,"Sortie stockage digestat phase brut pour épandage","Sortie stockage digestat phase liquide pour épandage","Sortie stockage digestat phase solide pour épandage",null,null,"Epandage digestat phase brut","Epandage digestat phase liquide","Epandage digestat phase solide",null,"Mineral Fertilizer Equivalent","Digestat épandu phase brut","Digestat épandu phase liquide","Digestat épandu phase solide"]
["MB (t)",{"$f":"'Données projet substrat'!G4","v":{"v":0,"d":"0.0"}},"/",{"$f":"'Données projet substrat'!BA4","v":{"v":0,"d":"0.00"}},"/",{"$f":"(D5-B5)/B5","v":{"$error":"#DIV/0!"}},{"$f":"IF('Données projet'!B87=\"centrifugeuse\",'BDD modélisation ICV'!B82,IF('Données projet'!B87=\"presse à vis\",'BDD modélisation ICV'!C82,0))","v":{"v":0,"d":"0%"}},{"$f":"D5*(1-'Données projet'!B$88)","v":{"v":0,"d":"0.00"}},{"$f":"IF(G5=0,0,D5-H5)","v":{"v":0,"d":"0.00"}},{"$f":"IF(G5=0,0,((1-G5)*I5))","v":{"v":0,"d":"0.00"}},{"$f":"IF(G5=0,0,J5*'Données projet'!$B$89)","v":{"v":0,"d":"0.00"}},{"$f":"IF(G5=0,H5,H5+K5)","v":{"v":0,"d":"0.00"}},{"$f":"IF(G5=0,0,J5-K5)","v":{"v":0,"d":"0.00"}},{"$f":"IF(G5=0,0,(G5*I5))","v":{"v":0,"d":"0.00"}},"MB (t)",{"$f":"L5-(L6-P6)","v":{"v":0,"d":"0.00"}},{"$f":"M5-(M6-Q6)","v":{"v":0,"d":"0.00"}},{"$f":"N5-(N6-R6)","v":{"v":0,"d":"0.00"}},null,"Ntot (kg)",{"$f":"P8","v":{"v":0,"d":"0.00"}},{"$f":"Q8","v":{"v":0,"d":"0.00"}},{"v":0,"d":"0.00"}]
["MS (t)",{"$f":"'Données projet substrat'!V4","v":{"v":0,"d":"0.0"}},{"$f":"B6*1000/$B$5","v":{"$error":"#DIV/0!"}},{"$f":"'Données projet substrat'!W4","v":{"v":0,"d":"0.00"}},{"$f":"D6*1000/$D$5","v":{"$error":"#DIV/0!"}},{"$f":"(D6-B6)/B6","v":{"$error":"#DIV/0!"}},{"$f":"IF('Données projet'!B87=\"centrifugeuse\",'BDD modélisation ICV'!B83,IF('Données projet'!B87=\"presse à vis\",'BDD modélisation ICV'!C83,0))","v":{"v":0,"d":"0%"}},{"$f":"D6*(1-'Données projet'!B$88)","v":{"v":0,"d":"0.00"}},{"$f":"IF(G6=0,0,D6-H6)","v":{"v":0,"d":"0.00"}},{"$f":"IF(G6=0,0,((1-G6)*I6))","v":{"v":0,"d":"0.00"}},{"$f":"IF(G6=0,0,J6*'Données projet'!$B$89)","v":{"v":0,"d":"0.00"}},{"$f":"IF(G6=0,H6,H6+K6)","v":{"v":0,"d":"0.00"}},{"$f":"IF(G6=0,0,J6-K6)","v":{"v":0,"d":"0.00"}},{"$f":"IF(G6=0,0,(G6*I6))","v":{"v":0,"d":"0.00"}},"MS (t)",{"$f":"L6*(1-'BDD modélisation ICV'!B93)","v":0},{"$f":"M6*(1-'BDD modélisation ICV'!C93)","v":0},{"$f":"N6*(1-'BDD modélisation ICV'!D93)","v":0},null,"NH4+ (kg)",0,0,0,null,"N-NH4+ (kg)",{"$f":"U6/18*14","v":0},{"$f":"V6/18*14","v":0},{"$f":"W6/18*14","v":0}]
["MO (t)",{"$f":"'Données projet substrat'!X4","v":{"v":0,"d":"0.0"}},{"$f":"B7*1000/$B$5","v":{"$error":"#DIV/0!"}},{"$f":"'Données projet substrat'!Y4","v":{"v":0,"d":"0.00"}},{"$f":"D7*1000/$D$5","v":{"$error":"#DIV/0!"}},{"$f":"(D7-B7)/B7","v":{"$error":"#DIV/0!"}},{"$f":"IF('Données projet'!B87=\"centrifugeuse\",'BDD modélisation ICV'!B84,IF('Données projet'!B87=\"presse à vis\",'BDD modélisation ICV'!C84,0))","v":{"v":0,"d":"0%"}},{"$f":"D7*(1-'Données projet'!B$88)","v":{"v":0,"d":"0.00"}},{"v":0,"d":"0.00"},{"v":0,"d":"0.00"},{"$f":"IF(G7=0,0,J7*'Données projet'!$B$89)","v":{"v":0,"d":"0.00"}},{"$f":"IF(G7=0,H7,H7+K7)","v":{"v":0,"d":"0.00"}},{"v":0,"d":"0.00"},{"v":0,"d":"0.00"},"MO (t)",{"$f":"L7*(1-'BDD modélisation ICV'!B94)","v":0},{"$f":"M7*(1-'BDD modélisation ICV'!C94)","v":0},{"$f":"N7*(1-'BDD modélisation ICV'!D94)","v":0},null,"Norg (kg)",0,0,0,null,"Norg-mineralisé (kg)",{"$f":"U7*'BDD modélisation ICV'!B126","v":{"v":0,"d":"0.00"}},{"$f":"V7*'BDD modélisation ICV'!C126","v":{"v":0,"d":"0.00"}},{"$f":"W7*'BDD modélisation ICV'!D126","v":{"v":0,"d":"0.00"}}]
["Ntot (kg)",{"$f":"'Données projet substrat'!AR4","v":{"v":0,"d":"0.0"}},{"$f":"B8/$B$5","v":{"$error":"#DIV/0!"}},{"$f":"B8","v":{"v":0,"d":"0.00"}},{"$f":"D8/$D$5","v":{"$error":"#DIV/0!"}},{"$f":"(D8-B8)/B8","v":{"$error":"#DIV/0!"}},null,null,{"$f":"I9+I10","v":{"v":0,"d":"0.00"}},{"v":0,"d":"0.00"},{"$f":"K9+K10","v":{"v":0,"d":"0.00"}},{"v":0,"d":"0.00"},{"v":0,"d":"0.00"},{"v":0,"d":"0.00"},"Ntot (kg)",{"$f":"P9+P10","v":{"v":0,"d":"0.00"}},{"$f":"Q9+Q10","v":{"v":0,"d":"0.00"}},{"$f":"R9+R10","v":{"v":0,"d":"0.00"}},null,"NH4+ (kg)/N tot",{"$f":"IFERROR(P9/P8,0)","v":0},{"$f":"IFERROR(Q9/Q8,0)","v":0},{"$f":"IFERROR(R9/R8,0)","v":0},null,"N-pertes emissions (kg)",{"$f":"U11+U12+U15+U18","v":0},{"$f":"V11+V12+V15+V18","v":0},{"$f":"W11+W12+W15+W18","v":0}]
["NH4+ (kg)",{"$f":"'Données projet substrat'!AS4","v":{"v":0,"d":"0.0"}},{"$error":"#DIV/0!"},{"$f":"'Données projet substrat'!AT4*1000","v":{"v":0,"d":"0.00"}},{"$error":"#DIV/0!"},{"$error":"#DIV/0!"},{"$f":"IF('Données projet'!B87=\"centrifugeuse\",'BDD modélisation ICV'!B86,IF('Données projet'!B87=\"presse à vis\",'BDD modélisation ICV'!C86,0))","v":{"v":0,"d":"0%"}},{"$f":"D9*(1-'Données projet'!B$88)","v":{"v":0,"d":"0.00"}},{"v":0,"d":"0.00"},{"v":0,"d":"0.00"},{"$f":"IF(G9=0,0,J9*'Données projet'!$B$89)","v":{"v":0,"d":"0.00"}},{"$f":"IF(G9=0,H9,H9+K9)","v":{"v":0,"d":"0.00"}},{"v":0,"d":"0.00"},{"v":0,"d":"0.00"},"NH4+ (kg)",{"$f":"L9*(1-'BDD modélisation ICV'!B96)-L16*18/14","v":0},{"$f":"M9*(1-'BDD modélisation ICV'!C96)-M16*18/14","v":0},{"$f":"N9*(1-'BDD modélisation ICV'!D96)*18/14","v":0},null,"Emissions de N_NH3 avant abattement",{"$f":"U6*'BDD modélisation ICV'!B107/18*14","v":0},{"$f":"V6*'BDD modélisation ICV'!C107/18*14","v":0},{"$f":"W6*'BDD modélisation ICV'!D107/18*14","v":0}]
["Norg (kg)",{"$f":"B8-B9","v":{"v":0,"d":"0.0"}},{"$error":"#DIV/0!"},{"$f":"D8-D9","v":{"v":0,"d":"0.0"}},{"$error":"#DIV/0!"},{"$error":"#DIV/0!"},{"$f":"IF('Données projet'!B87=\"centrifugeuse\",'BDD modélisation ICV'!B85,IF('Données projet'!B87=\"presse à vis\",'BDD modélisation ICV'!C85,0))","v":{"v":0,"d":"0%"}},{"$f":"D10*(1-'Données projet'!B$88)","v":{"v":0,"d":"0.00"}},{"v":0,"d":"0.00"},{"v":0,"d":"0.00"},{"$f":"IF(G10=0,0,J10*'Données projet'!$B$89)","v":{"v":0,"d":"0.00"}},{"$f":"IF(G10=0,H10,H10+K10)","v":{"v":0,"d":"0.00"}},{"v":0,"d":"0.00"},{"v":0,"d":"0.00"},"Norg (kg)",{"$f":"L10*(1-'BDD modélisation ICV'!B95)-L18/44*28","v":0},{"$f":"M10*(1-'BDD modélisation ICV'!C95)-M18/44*28","v":0},{"$f":"N10*(1-'BDD modélisation ICV'!D95)-N18/44*28","v":0},null,"Facteur d'abatemment",{"$f":"_xlfn.XLOOKUP('Données projet'!B93,'BDD modélisation ICV'!A118:A121,'BDD modélisation ICV'!B118:B121,0)","v":0},{"$f":"VLOOKUP('Données projet'!B94,'BDD modélisation ICV'!A118:B121,2,0)","v":0},{"$f":"VLOOKUP('Données projet'!B95,'BDD modélisation ICV'!D118:E121,2,FALSE)","v":0}]
["P2O5 (kg)",{"$f":"'Données projet substrat'!AU4","v":{"v":0,"d":"0.0"}},{"$error":"#DIV/0!"},{"$f":"'Données projet substrat'!AU4","v":{"v":0,"d":"0.00"}},{"$error":"#DIV/0!"},{"$error":"#DIV/0!"},{"$f":"IF('Données projet'!B87=\"centrifugeuse\",'BDD modélisation ICV'!B87,IF('Données projet'!B87=\"presse à vis\",'BDD modélisation ICV'!C87,0))","v":{"v":0,"d":"0%"}},{"$f":"D11*(1-'Données projet'!B$88)","v":{"v":0,"d":"0.00"}},{"v":0,"d":"0.00"},{"v":0,"d":"0.00"},{"$f":"IF(G11=0,0,J11*'Données projet'!$B$89)","v":{"v":0,"d":"0.00"}},{"$f":"IF(G11=0,H11,H11+K11)","v":{"v":0,"d":"0.00"}},{"v":0,"d":"0.00"},{"v":0,"d":"0.00"},"P2O5 (kg)",{"$f":"L11","v":{"v":0,"d":"0.00"}},{"v":0,"d":"0.00"},{"v":0,"d":"0.00"},null,"Emissions de N_NH3 après abattement",{"$f":"U9*(1-U10)","v":0},{"$f":"V9*(1-V10)","v":0},{"$f":"W9*(1-W10)","v":0},null,"N-assimilable (kg) / Ntot (kg)",{"$f":"IFERROR(Z14/U5,0)","v":0},{"$f":"IFERROR(AA14/V5,0)","v":0},{"$f":"IFERROR(AB14/W5,0)","v":0}]
["K2O (kg)",{"$f":"'Données projet substrat'!AV4","v":{"v":0,"d":"0.0"}},{"$error":"#DIV/0!"},{"$f":"'Données projet substrat'!AV4","v":{"v":0,"d":"0.00"}},{"$error":"#DIV/0!"},{"$f":"(D12-B12)/B12","v":{"$error":"#DIV/0!"}},{"$f":"IF('Données projet'!B87=\"centrifugeuse\",'BDD modélisation ICV'!B88,IF('Données projet'!B87=\"presse à vis\",'BDD modélisation ICV'!C88,0))","v":{"v":0,"d":"0%"}},{"$f":"D12*(1-'Données projet'!B$88)","v":{"v":0,"d":"0.00"}},{"v":0,"d":"0.00"},{"v":0,"d":"0.00"},{"$f":"IF(G12=0,0,J12*'Données projet'!$B$89)","v":{"v":0,"d":"0.00"}},{"$f":"IF(G12=0,H12,H12+K12)","v":{"v":0,"d":"0.00"}},{"v":0,"d":"0.00"},{"v":0,"d":"0.00"},"K2O (kg)",{"v":0,"d":"0.00"},{"v":0,"d":"0.00"},{"v":0,"d":"0.00"},null,"Emissions de N-Nox",{"$f":"(U5-U11)*'BDD modélisation ICV'!B108","v":0},{"$f":"(V5-V11)*'BDD modélisation ICV'!C108","v":0},{"$f":"(W5-W11)*'BDD modélisation ICV'!D108","v":0}]
["C (kg)",{"$f":"'Données projet substrat'!AW4","v":{"v":0,"d":"0.0"}},{"$error":"#DIV/0!"},{"$f":"'Données projet substrat'!AZ4*1000","v":{"v":0,"d":"0.00"}},{"$error":"#DIV/0!"},{"$f":"(D13-B13)/B13","v":{"$error":"#DIV/0!"}},{"$f":"G7","v":{"v":0,"d":"0%"}},{"$f":"D13*(1-'Données projet'!B$88)","v":{"v":0,"d":"0.00"}},{"v":0,"d":"0.00"},{"v":0,"d":"0.00"},{"$f":"IF(G13=0,0,J13*'Données projet'!$B$89)","v":{"v":0,"d":"0.00"}},{"$f":"IF(G13=0,H13,H13+K13)","v":{"v":0,"d":"0.00"}},{"v":0,"d":"0.00"},{"v":0,"d":"0.00"},"C (kg)",{"$f":"L13*(1-'BDD modélisation ICV'!B97)","v":0},{"$f":"M13*(1-'BDD modélisation ICV'!C97)","v":0},{"$f":"N13*(1-'BDD modélisation ICV'!D97)","v":0},null,"Emissions de N2O indirect (via NH3 et Nox)",{"$f":"(U11+U12)*'BDD modélisation ICV'!B110","v":0},{"$f":"(V11+V12)*'BDD modélisation ICV'!C110","v":0},{"$f":"(W11+W12)*'BDD modélisation ICV'!D110","v":0}]
[{"$nulls":10},"Emissions de CH4",{"$f":"IF('Données projet'!B91=\"couvert avec récupération du biogaz\",0,(L13-P13)*'BDD modélisation ICV'!B101/12*16)","v":0},{"$f":"IF('Données projet'!B90=\"couvert avec récupération du biogaz\",0,(M13-Q13)*'BDD modélisation ICV'!C101/12*16)","v":0},{"$f":"(N13-R13)*'BDD modélisation ICV'!D101/12*16","v":0},{"$nulls":10},"MFE - N (kg)",{"$f":"Z6+Z7-Z8","v":{"v":0,"d":"0.00"}},{"$f":"AA6+AA7-AA8","v":{"v":0,"d":"0.00"}},{"$f":"AB6+AB7-AB8","v":{"v":0,"d":"0.00"}}]
[{"$nulls":10},"Emissions de CO2",{"$f":"(L13-P13)*(1-'BDD modélisation ICV'!B101)/12*44","v":0},{"$f":"(M13-Q13)*(1-'BDD modélisation ICV'!C101)/12*44","v":0},{"$f":"(N13-R13)*(1-'BDD modélisation ICV'!D101)/12*44","v":0},{"$nulls":5},"Lessivage de N-NO3-",{"$f":"(U5)*'BDD modélisation ICV'!B111","v":0},{"$f":"(V5)*'BDD modélisation ICV'!C111","v":0},{"$f":"(W5)*'BDD modélisation ICV'!D111","v":0},null,"MFE - P2O5 (kg)",{"$f":"P11*0.95","v":{"v":0,"d":"0.00"}},{"$f":"Q11*0.95","v":{"v":0,"d":"0.00"}},{"$f":"R11*0.95","v":{"v":0,"d":"0.00"}}]
[{"$nulls":10},"Emissions de N_NH3",{"$f":"IF(OR('Données projet'!B91=\"couvert avec récupération du biogaz\",'Données projet'!B91=\"couvert\"),L9*'BDD modélisation ICV'!B102/18*14*0.3,L9*'BDD modélisation ICV'!B102/18*14)","v":0},{"$f":"IF(OR('Données projet'!B90=\"couvert avec récupération du biogaz\",'Données projet'!B90=\"couvert\"),M9*'BDD modélisation ICV'!C102/18*14*0.3,M9*'BDD modélisation ICV'!C102/18*14)","v":0},{"$f":"(N9-R9)*'BDD modélisation ICV'!D102/18*14","v":{"v":0,"d":"0.00"}},"Débit de chantier d'épandage (h)",{"$f":"P5/'BDD modélisation ICV'!B122","v":0},{"$f":"Q5/'BDD modélisation ICV'!B122","v":0},{"$f":"R5/'BDD modélisation ICV'!E122","v":0},null,"Emissions de N-N2O indirect (via NO3-)",{"$f":"U15*'BDD modélisation ICV'!B112","v":0},{"$f":"V15*'BDD modélisation ICV'!C112","v":0},{"$f":"W15*'BDD modélisation ICV'!D112","v":0},null,"MFE - K2O (kg)",{"$f":"P12","v":{"v":0,"d":"0.00"}},{"$f":"Q12","v":{"v":0,"d":"0.00"}},{"$f":"R12","v":{"v":0,"d":"0.00"}}]
[{"$nulls":10},"Emissions de N2O (indirect)",{"$f":"(L16*0.01)/28*44","v":0},{"$f":"(M16*0.01)/28*44","v":0},0,"L de diesel pour l'épandage",{"$f":"P16*'BDD ITK culture'!R14","v":0},{"$f":"Q16*'BDD ITK culture'!R14","v":0},{"$f":"R16*'BDD ITK culture'!S14","v":0}]
[{"$nulls":10},"Emissions de N2O (direct)",{"$f":"IF(OR('Données projet'!B91=\"couvert avec récupération du biogaz\",'Données projet'!B91=\"couvert\"),L9*'BDD modélisation ICV'!B103/28*44*0.3,L9*'BDD modélisation ICV'!B103/28*44)","v":0},{"$f":"IF(OR('Données projet'!B91=\"couvert avec récupération du biogaz\",'Données projet'!B91=\"couvert\"),M9*'BDD modélisation ICV'!C103/28*44*0.3,M9*'BDD modélisation ICV'!C103/28*44)","v":0},{"$f":"((N9-R9)*'BDD modélisation ICV'!D103)/28*44","v":0},"kg de diesel pour l'épandage",{"$f":"P17*'BDD modélisation ICV'!A135","v":0},{"$f":"Q17*'BDD modélisation ICV'!A135","v":0},{"$f":"R17*'BDD modélisation ICV'!A135","v":0},null,"Emissions directes de N-N2O",{"$f":"U5*'BDD modélisation ICV'!B113","v":0},{"$f":"V5*'BDD modélisation ICV'!C113","v":0},{"$f":"W5*'BDD modélisation ICV'!D113","v":0},null,"N-répartition entre les phases",{"$f":"IFERROR(Z14/SUM($Z$14:$AB$14),0)","v":0},{"$f":"IFERROR(AA14/SUM($Z$14:$AB$14),0)","v":0},{"$f":"IFERROR(AB14/SUM($Z$14:$AB$14),0)","v":0}]
[{"$nulls":10},"kg eq CO2 20 ans",{"$f":"L14*FC_CH4B20+(L18+L17)*FC_N2O20","v":0},{"$f":"M14*FC_CH4B20+(M18+M17)*FC_N2O20","v":0},{"$f":"N14*FC_CH4B20+(N18+N17)*FC_N2O20","v":0},"kg eq CO2 20 ans",{"$f":"$P$18*('BDD export Ecoinvent - SIMAPRO'!D8+'BDD export Ecoinvent - SIMAPRO'!E8)","v":0},{"$f":"$Q$18*('BDD export Ecoinvent - SIMAPRO'!D8+'BDD export Ecoinvent - SIMAPRO'!E8)","v":0},{"$f":"$R$18*('BDD export Ecoinvent - SIMAPRO'!D8+'BDD export Ecoinvent - SIMAPRO'!E8)","v":0},{"$nulls":6},"N (kg) -digestat sur CIVES et cultures principales du système de méthanisation",{"$f":"'Données projet substrat'!CD4","v":{"v":0,"d":"0.00"}}]
[{"$nulls":10},"kg eq CO2 100 ans",{"$f":"L14*FC_CH4B100+(L17+L18)*FC_N2O100","v":0},{"$f":"M14*FC_CH4B100+(M17+M18)*FC_N2O100","v":0},{"$f":"N14*FC_CH4B100+(N17+N18)*FC_N2O100","v":0},"kg eq CO2 100 ans",{"$f":"$P$18*('BDD export Ecoinvent - SIMAPRO'!D9+'BDD export Ecoinvent - SIMAPRO'!E9)","v":0},{"$f":"$Q$18*('BDD export Ecoinvent - SIMAPRO'!D9+'BDD export Ecoinvent - SIMAPRO'!E9)","v":0},{"$f":"$R$18*('BDD export Ecoinvent - SIMAPRO'!D9+'BDD export Ecoinvent - SIMAPRO'!E9)","v":0},null,"Emissions totales de N-N2O",{"$f":"U13+U16+U18","v":0},{"$f":"V13+V16+V18","v":0},{"$f":"W13+W16+W18","v":0}]
[{"$nulls":14},"Ressources fossiles et nucléaires (kWh eq)",{"$f":"$P$18*('BDD export Ecoinvent - SIMAPRO'!D10+'BDD export Ecoinvent - SIMAPRO'!E10)","v":0},{"$f":"$Q$18*('BDD export Ecoinvent - SIMAPRO'!D10+'BDD export Ecoinvent - SIMAPRO'!E10)","v":0},{"$f":"$R$18*('BDD export Ecoinvent - SIMAPRO'!D10+'BDD export Ecoinvent - SIMAPRO'!E10)","v":0},null,"kg eq CO2 20 ans",{"$f":"U20/28*44*FC_N2O20","v":0},{"$f":"V20/28*44*FC_N2O20","v":0},{"$f":"W20/28*44*FC_N2O20","v":0},null,"N (kg) -digestat sur CIVES et cultures principales du système de méthanisation - répartition entre les phases produites par le système",{"$f":"$Z$19*Z18","v":0},{"$f":"$Z$19*AA18","v":0},{"$f":"$Z$19*AB18","v":0}]
[{"$nulls":10},"Emissions de N_N2O (direct)",{"$f":"IF(OR('Données projet'!B91=\"couvert avec récupération du biogaz\",'Données projet'!B91=\"couvert\"),L9*'BDD modélisation ICV'!B103*0.3,L9*'BDD modélisation ICV'!B103)","v":0},{"$f":"IF(OR('Données projet'!B91=\"couvert avec récupération du biogaz\",'Données projet'!B91=\"couvert\"),M9*'BDD modélisation ICV'!C103*0.3,M9*'BDD modélisation ICV'!C103)","v":0},{"$f":"((N9-R9)*'BDD modélisation ICV'!D103)","v":0},{"$nulls":5},"kg eq CO2 100 ans",{"$f":"U20/28*44*FC_N2O100","v":0},{"$f":"V20/28*44*FC_N2O100","v":0},{"$f":"W20/28*44*FC_N2O100","v":0},null,"N (kg) - exporté",{"$f":"IF(Z14-Z21<0,0,Z14-Z21)","v":{"v":0,"d":"0.00"}},{"$f":"IF(AA14-AA21<0,0,AA14-AA21)","v":{"v":0,"d":"0.00"}},{"v":0,"d":"0.00"}]
[null,"Cultures dédiées","Cultures dédiées déclassées","CIVE d'hiver","CIVE d'été",{"$nulls":19},"P2O5 (kg) - exporté",{"$f":"IFERROR(Z15*Z22/Z14,0)","v":0},{"$f":"IFERROR(AA15*AA22/AA14,0)","v":0},{"$f":"IFERROR(AB15*AB22/AB14,0)","v":0}]
["t de MS issu d'un ensilage",{"$f":"SUMIF('Données projet substrat'!D6:D1795,\"Cultures principales\",'Données projet substrat'!V6:V1795)","v":0},{"$f":"SUMIF('Données projet substrat'!D6:D1795,\"Cultures principales déclassées\",'Données projet substrat'!V6:V1795)","v":0},{"$f":"SUMIF('Données projet substrat'!D6:D1795,\"CIVE d'hiver\",'Données projet substrat'!V6:V1795)","v":0},{"$f":"SUMIF('Données projet substrat'!D6:D1795,\"CIVE d'été\",'Données projet substrat'!V6:V1795)","v":0},{"$nulls":5},"kg CO2 biogénique",{"$f":"L15","v":0},{"$f":"M15","v":0},{"$f":"N15","v":0},{"$nulls":5},"Sommes",{"$nulls":4},"K2O (kg) - exporté",{"$f":"IFERROR(Z16*Z22/Z14,0)","v":0},{"$f":"IFERROR(AA16*AA22/AA14,0)","v":0},{"$f":"IFERROR(AB16*AB22/AB14,0)","v":0}]
["Emissions de CH4",{"$f":"SUM(B24:C24)*1000*'BDD modélisation ICV'!E6/1000","v":0},null,{"$f":"SUM(D24:E24)*1000*'BDD modélisation ICV'!E6/1000","v":0},{"$nulls":6},"Emissions de méthane rapportées à la production exprimée",{"$nulls":8},"N_NH3",{"$f":"SUM(L16:N16,U11:W11,U12:W12)","v":0}]
["Emissions de N2O (direct)",{"$f":"SUM(B24:C24)/1000*'BDD modélisation ICV'!F6*1000","v":0},null,{"$f":"SUM(D24:E24)/1000*'BDD modélisation ICV'!F6*1000","v":0},{"$nulls":6},{"$f":"SUM(L26:N26)","v":{"$error":"#DIV/0!"}},{"$f":"L14/($C$80*1000)","v":{"$error":"#DIV/0!"}},{"$f":"M14/($C$80*1000)","v":{"$error":"#DIV/0!"}},{"$f":"N14/($C$80*1000)","v":{"$error":"#DIV/0!"}},{"$nulls":5},"N_N20 direct",{"$f":"SUM(L22:N22)*28/44+SUM(U18:W18)","v":0}]
["kg eq CO2 20 ans",{"$f":"B25*FC_CH4B20+B26*FC_N2O20","v":0},null,{"$f":"D25*FC_CH4B20+D26*FC_N2O20","v":0},{"$nulls":15},"N_NO3-",{"$f":"SUM(U15:W15)","v":0}]
["kg eq CO2 100 ans",{"$f":"B25*FC_CH4B100+B26*FC_N2O100","v":0},null,{"$f":"D25*FC_CH4B100+D26*FC_N2O100","v":0},{"$nulls":7},{"$f":"IF(OR('Données projet'!B91=\"couvert avec récupération du biogaz\",'Données projet'!B91=\"couvert\"),L9*'BDD modélisation ICV'!B102/18*14*0.7,L9*'BDD modélisation ICV'!B102/18*14)","v":0},{"$f":"IF(OR('Données projet'!B90=\"couvert avec récupération du biogaz\",'Données projet'!B90=\"couvert\"),M9*'BDD modélisation ICV'!C102/18*14*0.7,M9*'BDD modélisation ICV'!C102/18*14)","v":0},{"$nulls":7},{"$f":"SUM(U25:U27)","v":0}]
[]
[]
["2. ITK"]
["Consommation tracteurs","Cultures principales","CIVES"]
["Consommation diesel (kg)",{"$f":"SUMIF('Données projet substrat'!D6:D1795,\"Cultures principales\",'Données projet substrat'!BQ6:BQ1795)","v":{"v":0,"d":"0.00"}},{"$f":"SUMIF('Données projet substrat'!D6:D1795,\"CIVE*\",'Données projet substrat'!BQ6:BQ1795)","v":{"v":0,"d":"0.00"}}]
["kg eq CO2 20 ans",{"$f":"$B$33*('BDD export Ecoinvent - SIMAPRO'!D8+'BDD export Ecoinvent - SIMAPRO'!E8)","v":{"v":0,"d":"0.00"}},{"$f":"$C$33*('BDD export Ecoinvent - SIMAPRO'!D8+'BDD export Ecoinvent - SIMAPRO'!E8)","v":{"v":0,"d":"0.00"}}]
["kg eq CO2 100 ans",{"$f":"$B$33*('BDD export Ecoinvent - SIMAPRO'!D9+'BDD export Ecoinvent - SIMAPRO'!E9)","v":{"v":0,"d":"0.00"}},{"$f":"$C$33*('BDD export Ecoinvent - SIMAPRO'!D9+'BDD export Ecoinvent - SIMAPRO'!E9)","v":{"v":0,"d":"0.00"}}]
["Ressources fossiles et nucléaires (kWh eq)",{"$f":"B33*('BDD export Ecoinvent - SIMAPRO'!E10+'BDD export Ecoinvent - SIMAPRO'!D10)","v":{"v":0,"d":"0.00"}},{"$f":"C33*('BDD export Ecoinvent - SIMAPRO'!E10+'BDD export Ecoinvent - SIMAPRO'!D10)","v":{"v":0,"d":"0.00"}}]
["Fertlisation minérale","Cultures principales","CIVES"]
["Fertilisation N (kg)",{"$f":"SUMIF('Données projet substrat'!D6:D1795,\"Cultures principales\",'Données projet substrat'!CB6:CB1795)","v":{"v":0,"d":"0.00"}},{"$f":"SUMIF('Données projet substrat'!D6:D1795,\"CIVE*\",'Données projet substrat'!CB6:CB1795)","v":{"v":0,"d":"0.00"}}]
["Fertilisation K (kg)",{"$f":"SUMIF('Données projet substrat'!D6:D1795,\"Cultures principales\",'Données projet substrat'!CE6:CE1795)","v":{"v":0,"d":"0.00"}},{"$f":"SUMIF('Données projet substrat'!D6:D1795,\"CIVE*\",'Données projet substrat'!CE6:CE1795)","v":{"v":0,"d":"0.00"}}]
["Fertilisation P (kg)",{"$f":"SUMIF('Données projet substrat'!D6:D1795,\"Cultures principales\",'Données projet substrat'!CF6:CF1795)","v":{"v":0,"d":"0.00"}},{"$f":"SUMIF('Données projet substrat'!D6:D1795,\"CIVE*\",'Données projet substrat'!CF6:CF1795)","v":{"v":0,"d":"0.00"}}]
["kg eq CO2 20 ans",{"$f":"$B$38*('BDD export Ecoinvent - SIMAPRO'!G8+'BDD export Ecoinvent - SIMAPRO'!D49)+$B$39*'BDD export Ecoinvent - SIMAPRO'!I8+$B$40*'BDD export Ecoinvent - SIMAPRO'!H8","v":{"v":0,"d":"0.00"}},{"$f":"$C$38*('BDD export Ecoinvent - SIMAPRO'!G8+'BDD export Ecoinvent - SIMAPRO'!D49)+$C$39*'BDD export Ecoinvent - SIMAPRO'!I8+$C$40*'BDD export Ecoinvent - SIMAPRO'!H8","v":{"v":0,"d":"0.00"}}]
["kg eq CO2 100 ans",{"$f":"$B$38*('BDD export Ecoinvent - SIMAPRO'!G9+'BDD export Ecoinvent - SIMAPRO'!D50)+$B$39*'BDD export Ecoinvent - SIMAPRO'!I9+$B$40*'BDD export Ecoinvent - SIMAPRO'!H9","v":{"v":0,"d":"0.00"}},{"$f":"$C$38*('BDD export Ecoinvent - SIMAPRO'!G9+'BDD export Ecoinvent - SIMAPRO'!D50)+$C$39*'BDD export Ecoinvent - SIMAPRO'!I9+$C$40*'BDD export Ecoinvent - SIMAPRO'!H9","v":{"v":0,"d":"0.00"}}]
["Ressources fossiles et nucléaires (kWh eq)",{"$f":"$B$38*'BDD export Ecoinvent - SIMAPRO'!G10+$B$39*'BDD export Ecoinvent - SIMAPRO'!I10+$B$40*'BDD export Ecoinvent - SIMAPRO'!H10","v":{"v":0,"d":"0.00"}},{"$f":"$C$38*'BDD export Ecoinvent - SIMAPRO'!G10+$C$39*'BDD export Ecoinvent - SIMAPRO'!I10+$C$40*'BDD export Ecoinvent - SIMAPRO'!H10","v":{"v":0,"d":"0.00"}}]
["Fertilisation organique","Cultures principales","CIVES"]
["Fertilisation N (kg)",{"$f":"SUMIF('Données projet substrat'!D6:D1795,\"Cultures principales\",'Données projet substrat'!CC6:CC1795)","v":{"v":0,"d":"0.00"}},{"$f":"SUMIF('Données projet substrat'!D6:D1795,\"CIVE*\",'Données projet substrat'!CC6:CC1795)","v":{"v":0,"d":"0.00"}},null,null,"Epandage d'effluent organique suivant IPCC (2019) - Cultures principales","Epandage d'effluent organique suivant IPCC (2019) - CIVES"]
["Fertilisation K (kg)",{"$f":"SUMIF('Données projet substrat'!D6:D1795,\"Cultures principales\",'Données projet substrat'!CE6:CE1795)","v":{"v":0,"d":"0.00"}},{"$f":"SUMIF('Données projet substrat'!D6:D1795,\"CIVE*\",'Données projet substrat'!CE6:CE1795)","v":{"v":0,"d":"0.00"}},null,"Ntot (kg)",{"$f":"B45","v":{"v":0,"d":"0.00"}},{"$f":"C45","v":{"v":0,"d":"0.00"}}]
["Fertilisation P (kg)",{"$f":"SUMIF('Données projet substrat'!D6:D1795,\"Cultures principales\",'Données projet substrat'!CF6:CF1795)","v":{"v":0,"d":"0.00"}},{"$f":"SUMIF('Données projet substrat'!D6:D1795,\"CIVE*\",'Données projet substrat'!CF6:CF1795)","v":{"v":0,"d":"0.00"}},null,"Emissions de N_NH3 après abattement",{"$f":"F46*'BDD modélisation ICV'!$H$109","v":0},{"$f":"G46*'BDD modélisation ICV'!$H$109","v":0}]
["kg eq CO2 20 ans",{"$f":"F53","v":{"v":0,"d":"0.00"}},{"$f":"G53","v":{"v":0,"d":"0.00"}},null,"Emissions de N2O indirect (via NH3 et Nox)",{"$f":"F47*'BDD modélisation ICV'!$H$110","v":0},{"$f":"G47*'BDD modélisation ICV'!$H$110","v":0}]
["kg eq CO2 100 ans",{"$f":"F54","v":{"v":0,"d":"0.00"}},{"$f":"G54","v":{"v":0,"d":"0.00"}},null,"Lessivage de N-NO3-",{"$f":"F46*'BDD modélisation ICV'!$H$111","v":0},{"$f":"G46*'BDD modélisation ICV'!$H$111","v":0}]
["kg CO2 biogénique",{"$nulls":3},"Emissions de N-N2O indirect (via NO3-)",{"$f":"F49*'BDD modélisation ICV'!$H$112","v":0},{"$f":"G49*'BDD modélisation ICV'!$H$112","v":0}]
["Ressources fossiles et nucléaires (kWh eq)",{"$nulls":3},"Emissions directes de N-N2O",{"$f":"F46*'BDD modélisation ICV'!$H$113","v":0},{"$f":"G46*'BDD modélisation ICV'!$H$113","v":0}]
["Application de produits phytosanitaires","Cultures principales","CIVES",null,"Emissions totales de N-N2O",{"$f":"F48+F50+F51","v":0},{"$f":"G48+G50+G51","v":0}]
["Phytosanitaires (kg)",{"$f":"SUMIF('Données projet substrat'!D6:D1795,\"Cultures principales\",'Données projet substrat'!CG6:CG1795)","v":{"v":0,"d":"0.00"}},{"$f":"SUMIF('Données projet substrat'!D6:D1795,\"CIVE*\",'Données projet substrat'!CG6:CG1795)","v":{"v":0,"d":"0.00"}},null,"kg eq CO2 20 ans",{"$f":"F52/28*44*FC_N2O20","v":0},{"$f":"G52/28*44*FC_N2O20","v":0}]
["kg eq CO2 20 ans",{"$f":"$B$53*'BDD export Ecoinvent - SIMAPRO'!J8","v":{"v":0,"d":"0.00"}},{"$f":"$C$53*'BDD export Ecoinvent - SIMAPRO'!J8","v":{"v":0,"d":"0.00"}},null,"kg eq CO2 100 ans",{"$f":"F52/28*44*FC_N2O100","v":0},{"$f":"G52/28*44*FC_N2O100","v":0}]
["kg eq CO2 100 ans",{"$f":"$B$53*'BDD export Ecoinvent - SIMAPRO'!J9","v":{"v":0,"d":"0.00"}},{"$f":"$C$53*'BDD export Ecoinvent - SIMAPRO'!J9","v":{"v":0,"d":"0.00"}}]
["Ressources fossiles et nucléaires (kWh eq)",{"$f":"$B$53*'BDD export Ecoinvent - SIMAPRO'!J10","v":{"v":0,"d":"0.00"}},{"$f":"$C$53*'BDD export Ecoinvent - SIMAPRO'!J10","v":{"v":0,"d":"0.00"}}]
[]
["3. Transport"]
["Transport collecte au diesel (t.km)",{"$f":"SUMPRODUCT('Données projet substrat'!I6:I1880,(1-'Données projet substrat'!J6:J1880))+SUMPRODUCT(IF('Données projet substrat'!E6:E1880=\"Soupe de déconditionnement\",'Données projet substrat'!G6:G1880*(1-'Données projet substrat'!J6:J1880)*'Données projet'!$B$18))","v":0}]
["kg eq CO2 20 ans",{"$f":"B59*'BDD export Ecoinvent - SIMAPRO'!F8","v":{"v":0,"d":"0.00"}}]
["kg eq CO2 100 ans",{"$f":"B59*'BDD export Ecoinvent - SIMAPRO'!F9","v":{"v":0,"d":"0.00"}}]
["Ressources fossiles et nucléaires (kWh eq)",{"$f":"B59*'BDD export Ecoinvent - SIMAPRO'!F10","v":{"v":0,"d":"0.00"}}]
["Transport collecte au bioGNV (t.km)",{"$f":"SUMPRODUCT('Données projet substrat'!I6:I1880,'Données projet substrat'!J6:J1880)","v":0}]
["Transport digestat (t.km)",{"$f":"'Données projet'!B92*SUM(P5:R5)","v":{"$error":"#VALUE!"}}]
["kg eq CO2 20 ans",{"$f":"B64*'BDD export Ecoinvent - SIMAPRO'!F8","v":{"$error":"#VALUE!"}}]
["kg eq CO2 100 ans",{"$f":"B64*'BDD export Ecoinvent - SIMAPRO'!F9","v":{"$error":"#VALUE!"}}]
["kg CO2 biogénique"]
["Ressources fossiles et nucléaires (kWh eq)",{"$f":"B64*'BDD export Ecoinvent - SIMAPRO'!F10","v":{"$error":"#VALUE!"}}]
[]
["4. Emissions fugitives"]
["% émissions fugitives",{"v":0.11569354653964982,"d":"11.6%"},"--> Paramètre variabledu SOLVER (doit être supérieur à 0). À chaque lancement de calcul complet, recréer la liaison vers \"='Calculs fonctionnement'!B71\" avant de relancer le SOLVER"]
["GES émis à 100 ans",{"$f":"(B28+D28+B35+B180+B42+B49+B55+C35+F180+C42+C49+C55+SUMIF('Données projet substrat'!F6:F14,\"Fumier\",'Données projet substrat'!CI6:CI14)+SUMIF('Données projet substrat'!F6:F14,\"Lisier\",'Données projet substrat'!CI6:CI14)+B61+C218*B213+C219*L213*L211+IF(B218=1,B239,C213*C211+C219*M213)+F87+B96+B199+C218*D211*D213+B87+C218*K211*K213+B109+B128+C218*G211*G213+C218*H211*H213+B146+C218*I211*I213+B154+B167+C218*J211*J213+B192+B180+C218*E211*E213+C218*F211*F213+L20+M20+N20+P20+U22+Q20+V22+R20+W22+B66)/1000","v":{"$error":"#VALUE!"}}]
["GES évités à 100 ans",{"$f":"(-B246-B265-B269-B273-B250-B254-B304-B259)/1000","v":{"v":0,"d":"0.00"}},null,"Cellule E73 à faire apparaitre dans les résultats si le SOLVER est appliqué",{"$f":"IF(B74>0,\"\",B71)","v":{"$error":"#VALUE!"}}]
["Score net aggrégé à 100 ans (t éq CO2)",{"$f":"B72+B73","v":{"$error":"#VALUE!"}},"Si score négatif, objectif du solveur = annuler le score net aggrégé"]
[]
["5. Flux de gaz (énergie primaire)"]
["Calculs généraux (cogé ET épuration/injection)"]
[null,"Volume (m3)","Masse (t)","MJ","kWh","Résultats des infrastructures du digesteur"]
["Digesteur"]
["CH4 produit dans le digesteur",{"$f":"'Données projet substrat'!AB4","v":{"v":0,"d":"0.00"}},{"$f":"B80*massevol_CH4/1000","v":{"v":0,"d":"0.00"}},{"$f":"C80*1000*PCI_CH4","v":{"v":0,"d":"0.00"}},{"$f":"D80/3.6","v":{"v":0,"d":"0.00"}}]
["CO2 produit dans le digesteur",{"$f":"'Données projet substrat'!AI4","v":{"v":0,"d":"0.00"}},{"$f":"B81*massevol_CO2/1000","v":{"v":0,"d":"0.00"}}]
["% CH4",{"$f":"B80/(B80+B81)","v":{"$error":"#DIV/0!"}},{"$f":"C80/(C80+C81)","v":{"$error":"#DIV/0!"}}]
["Biogaz total produit dans le digesteur",{"$f":"B80+B81","v":{"v":0,"d":"0.00"}},{"$f":"C80+C81","v":{"v":0,"d":"0.00"}}]
["CH4 émissions fugitives",{"$f":"B80*B71","v":{"v":0,"d":"0.00"}},{"$f":"B84*massevol_CH4/1000","v":{"v":0,"d":"0.00"}},{"$f":"C84*1000*PCI_CH4","v":{"v":0,"d":"0.00"}},{"$f":"D84/3.6","v":{"v":0,"d":"0.00"}}]
["CO2 émissions fugitives",{"$f":"B81*B71","v":{"v":0,"d":"0.00"}},{"$f":"B85*massevol_CO2/1000","v":{"v":0,"d":"0.00"}}]
["kg eq CO2 20 ans",{"$f":"C84*1000*FC_CH4B20","v":{"v":0,"d":"0.00"}},null,null,"kg eq CO2 20 ans",{"$f":"B83*'BDD export Ecoinvent - SIMAPRO'!X8*3.36311842881788E-08","v":{"v":0,"d":"0.00"}}]
["kg eq CO2 100 ans",{"$f":"C84*1000*FC_CH4B100","v":{"v":0,"d":"0.00"}},null,null,"kg eq CO2 100 ans",{"$f":"B83*'BDD export Ecoinvent - SIMAPRO'!X9*3.36311842881788E-08","v":{"v":0,"d":"0.00"}}]
["kg CO2 biogénique",{"$f":"C85*1000","v":{"v":0,"d":"0.00"}},null,null,"Ressources fossiles et nucléaires (kWh eq)",{"$f":"B83*'BDD export Ecoinvent - SIMAPRO'!X10*3.36311842881788E-08","v":{"v":0,"d":"0.00"}}]
[]
["Torchère"]
["CH4 torché",{"$f":"(B80-B84)*'Données projet'!B26","v":{"v":0,"d":"0.00"}},{"$f":"B91*massevol_CH4/1000","v":{"v":0,"d":"0.00"}},{"$f":"C91*1000*PCI_CH4","v":{"v":0,"d":"0.00"}},{"$f":"D91/3.6","v":{"v":0,"d":"0.00"}}]
["CH4 torché imbrulé",{"$f":"B91*'BDD modélisation ICV'!$B$72","v":{"v":0,"d":"0.00"}},{"$f":"B92*massevol_CH4/1000","v":{"v":0,"d":"0.00E+00"}},{"$f":"C92*1000*PCI_CH4","v":{"v":0,"d":"0.00"}},{"$f":"D92/3.6","v":{"v":0,"d":"0.00"}}]
["N2O produit par la combustion",{"$f":"E91*'BDD modélisation ICV'!$C$71","v":{"v":0,"d":"0.00E+00"}},{"$f":"B93*massevol_N2O/1000","v":{"v":0,"d":"0.00E+00"}}]
["CO2 torché",{"$f":"(B81-B85)*'BDD modélisation ICV'!$B$71","v":{"v":0,"d":"0.00"}},{"$f":"B94*massevol_CO2/1000","v":{"v":0,"d":"0.00"}}]
["kg eq CO2 20 ans",{"$f":"C92*1000*FC_CH4B20+C93*1000*FC_N2O20","v":{"v":0,"d":"0.00"}}]
["kg eq CO2 100 ans",{"$f":"C92*1000*FC_CH4B100+C93*1000*FC_N2O100","v":{"v":0,"d":"0.00"}}]
["kg CO2 biogénique",{"$f":"(C91*(44/16)+C94)*1000","v":{"v":0,"d":"0.00"}}]
[]
["Installation en cogénération"]
["Cogénérateur"]
["Biogaz détourné en épuration pour autoconsommation",{"$f":"B83*'Données projet'!B57","v":{"v":0,"d":"0.00"}},{"$f":"C102+C103","v":{"v":0,"d":"0.00"}}]
["CH4 détourné en épuration pour autoconsommation",{"$f":"B80*'Données projet'!B57","v":{"v":0,"d":"0.00"}},{"$f":"B102*massevol_CH4/1000","v":{"v":0,"d":"0.00"}},{"$f":"C102*1000*PCI_CH4","v":{"v":0,"d":"0.00"}},{"$f":"D102/3.6","v":{"v":0,"d":"0.00"}}]
["CO2 détourné en épuration pour autoconsommation",{"$f":"B81*'Données projet'!B57","v":{"v":0,"d":"0.00"}},{"$f":"B103*massevol_CO2/1000","v":{"v":0,"d":"0.00"}}]
["CH4 total envoyé en cogé",{"$f":"IF('Données projet'!B9=\"cogénération\",B80-B84-B91-B102,B114)","v":{"v":0,"d":"0.00"}},{"$f":"B104*massevol_CH4/1000","v":{"v":0,"d":"0.00"}},{"$f":"C104*1000*PCI_CH4","v":{"v":0,"d":"0.00"}},{"$f":"D104/3.6","v":{"v":0,"d":"0.00"}}]
["CH4 imbrulé en cogé",{"$f":"B104*'BDD modélisation ICV'!B73","v":{"v":0,"d":"0.00"}},{"$f":"B105*massevol_CH4/1000","v":{"v":0,"d":"0.00"}},{"$f":"C105*1000*PCI_CH4","v":{"v":0,"d":"0.00"}},{"$f":"D105/3.6","v":{"v":0,"d":"0.00"}}]
["CH4 total valorisable",{"$f":"B104-B105","v":{"v":0,"d":"0.00"}},{"$f":"C104-C105","v":{"v":0,"d":"0.00"}},{"$f":"C106*1000*PCI_CH4","v":{"v":0,"d":"0.00"}},{"$f":"D106/3.6","v":{"v":0,"d":"0.00"}}]
["CO2 total contenu dans le biogaz",{"$f":"IF('Données projet'!B9=\"cogénération\",B81-B85-B94,0)","v":{"v":0,"d":"0.00"}},{"$f":"B107*massevol_CO2/1000","v":{"v":0,"d":"0.00"}}]
["kg eq CO2 20 ans",{"$f":"C105*1000*FC_CH4B20","v":{"v":0,"d":"0.00"}}]
["kg eq CO2 100 ans",{"$f":"C105*1000*FC_CH4B100","v":{"v":0,"d":"0.00"}}]
["kg CO2 biogénique",{"$f":"0","v":{"v":0,"d":"0.00"}}]
[]
["Installation en épuration/injection"]
["Epurateur"]
["Biogaz détourné vers une cogénatrice pour autoconsommation",{"$f":"B115+B116","v":{"v":0,"d":"0.00"}},{"$f":"C115+C116","v":{"v":0,"d":"0.00"}}]
["CH4 détourné vers une cogénatrice pour autoconsommation",{"$f":"((B80-B84-B91)*('Données projet'!B60))*(1-'BDD modélisation ICV'!B73)","v":{"v":0,"d":"0.00"}},{"$f":"B115*massevol_CH4/1000","v":{"v":0,"d":"0.00"}},{"$f":"C115*1000*PCI_CH4","v":{"v":0,"d":"0.00"}},{"$f":"D115/3.6","v":{"v":0,"d":"0.00"}}]
["CO2 détourné vers une cogénatrice pour autoconsommation",{"$f":"(B81-B85-B94)*('Données projet'!B60)","v":{"v":0,"d":"0.00"}},{"$f":"B116*massevol_CO2/1000","v":{"v":0,"d":"0.00"}}]
["Biogaz en entrée d'épurateur",{"$f":"IF('Données projet'!B9=\"Epuration/injection\",(B83-B84-B85-B91-B94)*(1-'Données projet'!B60),B101)","v":{"v":0,"d":"0.00"}},{"$f":"IF('Données projet'!B9=\"Epuration/injection\",C119+C118,0)","v":{"v":0,"d":"0.00"}}]
["CH4 en entrée d'épurateur",{"$f":"IF('Données projet'!B9=\"Epuration/injection\",(B80-B84-B91)*(1-'Données projet'!B60),B102)","v":{"v":0,"d":"0.00"}},{"$f":"B118*massevol_CH4/1000","v":{"v":0,"d":"0.00"}},{"$f":"C118*1000*PCI_CH4","v":{"v":0,"d":"0.00"}},{"$f":"D118/3.6","v":{"v":0,"d":"0.00"}}]
["CO2 en entrée d'épurateur",{"$f":"IF('Données projet'!B9=\"Epuration/injection\",(B81-B85-B94)*(1-'Données projet'!B60),B103)","v":{"v":0,"d":"0.00"}},{"$f":"B119*massevol_CO2/1000","v":{"v":0,"d":"0.00"}}]
["Rendement épurateur",{"$f":"IF('Données projet'!B61=\"membranaire\",'BDD modélisation ICV'!B48,'BDD modélisation ICV'!$B$49)","v":{"v":0.97,"d":"97.0%"}}]
["Pureté du biométhane",{"$f":"'BDD modélisation ICV'!$D$48","v":{"v":0.97,"d":"97.0%"}}]
["Off-gaz (CH4)",{"$f":"B118*(1-B120)","v":{"v":0,"d":"0.00"}},{"$f":"B122*massevol_CH4/1000","v":{"v":0,"d":"0.00"}},{"$f":"C122*1000*PCI_CH4","v":{"v":0,"d":"0.00"}},{"$f":"D122/3.6","v":{"v":0,"d":"0.00"}}]
["Off-gaz (CO2)",{"$f":"B119-B125","v":{"v":0,"d":"0.00"}},{"$f":"B123*massevol_CO2/1000","v":{"v":0,"d":"0.00"}}]
["Biométhane en sortie d'épurateur (CH4)",{"$f":"(B118*B120)","v":{"v":0,"d":"0.00"}},{"$f":"B124*massevol_CH4/1000","v":{"v":0,"d":"0.00"}},{"$f":"D118-D122","v":{"v":0,"d":"0.00"}},{"$f":"E118-E122","v":{"v":0,"d":"0.00"}}]
["Biométhane en sortie d'épurateur (CO2)",{"$f":"B124/B121*(1-B121)","v":{"v":0,"d":"0.00"}},{"$f":"B125*massevol_CO2/1000","v":{"v":0,"d":"0.00"}}]
["Consommation de charbon actif (kg)",{"$f":"'BDD modélisation ICV'!B51*'Calculs fonctionnement'!B117/1000","v":{"v":0,"d":"0.00"}}]
["kg eq CO2 20 ans",{"$f":"B126*'BDD export Ecoinvent - SIMAPRO'!W8","v":{"v":0,"d":"0.00"}}]
["kg eq CO2 100 ans",{"$f":"B126*'BDD export Ecoinvent - SIMAPRO'!W9","v":{"v":0,"d":"0.00"}}]
["Ressources fossiles et nucléaires (kWh eq)",{"$f":"B126*'BDD export Ecoinvent - SIMAPRO'!W10","v":{"v":0,"d":"0.00"}}]
["kg CO2 biogénique",{"$f":"C122*(44/16)*1000+C123*1000","v":{"v":0,"d":"0.00"}}]
[]
["Valorisation CO2"]
["Rendement de la valorisation",{"$f":"'Données projet'!B64","v":{"v":0,"d":"0%"}}]
["CO2 total récupéré",{"$f":"B123*B133","v":{"v":0,"d":"0.00"}},{"$f":"B134*massevol_CO2/1000","v":{"v":0,"d":"0.00"}}]
[]
["Poste d'injection"]
["Biométhane en entrée (CH4)",{"$f":"B124*(1-'Données projet'!B69)","v":{"v":0,"d":"0.00"}},{"$f":"B137*massevol_CH4/1000","v":{"v":0,"d":"0.00"}},{"$f":"C137*1000*PCI_CH4","v":{"v":0,"d":"0.00"}},{"$f":"D137/3.6","v":{"v":0,"d":"0.00"}}]
["Biométhane en entrée (CO2)",{"$f":"B125*(1-'Données projet'!B69)","v":{"v":0,"d":"0.00"}},{"$f":"B138*massevol_CO2/1000","v":{"v":0,"d":"0.00"}}]
["% de pertes",{"$f":"'BDD modélisation ICV'!E40","v":{"v":1E-3,"d":"0.10%"}}]
["Pertes de biométhane (CH4)",{"$f":"B137*B139","v":{"v":0,"d":"0.00"}},{"$f":"B140*massevol_CH4/1000","v":{"v":0,"d":"0.00"}},{"$f":"C140*1000*PCI_CH4","v":{"v":0,"d":"0.00"}},{"$f":"D140/3.6","v":{"v":0,"d":"0.00"}}]
["Pertes de biométhane (CO2)",{"$f":"B138*B139","v":{"v":0,"d":"0.00"}},{"$f":"B141*massevol_CO2/1000","v":{"v":0,"d":"0.00"}}]
["Biométhane injecté dans le réseau (CH4)",{"$f":"B137-B140","v":{"v":0,"d":"0.00"}},{"$f":"B142*massevol_CH4/1000","v":{"v":0,"d":"0.00"}},{"$f":"C142*1000*PCI_CH4","v":{"v":0,"d":"0.00"}},{"$f":"D142/3.6","v":{"v":0,"d":"0.00"}}]
["Biométhane injecté dans le réseau (CO2)",{"$f":"B138-B141","v":{"v":0,"d":"0.00"}},{"$f":"B143*massevol_CO2/1000","v":{"v":0,"d":"0.00"}}]
["Quantité de THT consommée",null,{"$f":"(B142+B143)*'BDD modélisation ICV'!B41/1000000","v":{"v":0,"d":"0.00E+00"}}]
["kg eq CO2 20 ans",{"$f":"C140*1000*FC_CH4B20*B121+C144*1000*'BDD export Ecoinvent - SIMAPRO'!U8","v":{"v":0,"d":"0.00"}}]
["kg eq CO2 100 ans",{"$f":"C140*1000*FC_CH4B100*B121+C144*1000*'BDD export Ecoinvent - SIMAPRO'!U9","v":{"v":0,"d":"0.00"}}]
["Ressources fossiles et nucléaires (kWh eq)",{"$f":"C144*1000*'BDD export Ecoinvent - SIMAPRO'!U10","v":{"v":0,"d":"0.00"}}]
["kg CO2 biogénique",{"$f":"C141*1000","v":{"v":0,"d":"0.00"}}]
[]
["Combustion du biométhane en chaudière"]
["Biométhane injecté dans le réseau et brûlé en chaudière (CH4)",{"$f":"B142","v":{"v":0,"d":"0.00"}},{"$f":"B151*massevol_CH4/1000","v":{"v":0,"d":"0.00"}},{"$f":"C151*1000*PCI_CH4","v":{"v":0,"d":"0.00"}},{"$f":"D151/3.6","v":{"v":0,"d":"0.00"}}]
["Biométhane injecté dans le réseau et brûlé en chaudière (CO2)",{"$f":"B143","v":{"v":0,"d":"0.00"}},{"$f":"B152*massevol_CO2/1000","v":{"v":0,"d":"0.00"}}]
["kg eq CO2 20 ans",{"$f":"($C$151+$C$152)*1000*'BDD export Ecoinvent - SIMAPRO'!P8","v":{"v":0,"d":"0.00"}}]
["kg eq CO2 100 ans",{"$f":"($C$151+$C$152)*1000*'BDD export Ecoinvent - SIMAPRO'!P9","v":{"v":0,"d":"0.00"}}]
["Ressources fossiles et nucléaires (kWh eq)",{"$f":"($C$151+$C$152)*1000*'BDD export Ecoinvent - SIMAPRO'!P10","v":{"v":0,"d":"0.00"}}]
["kg CO2 biogénique",{"$f":"C151*(44/16)+C152","v":{"v":0,"d":"0.00"}}]
[]
["Station GNV"]
["Biométhane en entrée (CH4)",{"$f":"B124*'Données projet'!B69","v":{"v":0,"d":"0.00"}},{"$f":"B159*massevol_CH4/1000","v":{"v":0,"d":"0.00"}},{"$f":"C159*1000*PCI_CH4","v":{"v":0,"d":"0.00"}},{"$f":"D159/3.6","v":{"v":0,"d":"0.00"}}]
["Biométhane en entrée (CO2)",{"$f":"B125*'Données projet'!B69","v":{"v":0,"d":"0.00"}},{"$f":"B160*massevol_CO2/1000","v":{"v":0,"d":"0.00"}}]
["% de pertes au remplissage du réservoire et d'imbrûlés dans le moteur",{"$f":"'BDD modélisation ICV'!E42","v":{"v":0.0101,"d":"1.01%"}}]
["Pertes de biométhane (CH4)",{"$f":"B159*B161","v":{"v":0,"d":"0.00"}},{"$f":"B162*massevol_CH4/1000","v":{"v":0,"d":"0.00"}},{"$f":"C162*1000*PCI_CH4","v":{"v":0,"d":"0.00"}},{"$f":"D162/3.6","v":{"v":0,"d":"0.00"}}]
["Pertes de biométhane (CO2)",{"$f":"B160*B161","v":{"v":0,"d":"0.00"}},{"$f":"B163*massevol_CO2/1000","v":{"v":0,"d":"0.00"}}]
["Biométhane injecté en station (CH4)",{"$f":"B159-B162","v":{"v":0,"d":"0.00"}},{"$f":"B164*massevol_CH4/1000","v":{"v":0,"d":"0.00"}},{"$f":"C164*1000*PCI_CH4","v":{"v":0,"d":"0.00"}},{"$f":"D164/3.6","v":{"v":0,"d":"0.00"}}]
["Biométhane injecté en station (CO2)",{"$f":"B160-B163","v":{"v":0,"d":"0.00"}},{"$f":"B165*massevol_CO2/1000","v":{"v":0,"d":"0.00"}}]
["kg eq CO2 20 ans",{"$f":"C162*1000*FC_CH4B20","v":{"v":0,"d":"0.00"}}]
["kg eq CO2 100 ans",{"$f":"C162*1000*FC_CH4B100","v":{"v":0,"d":"0.00"}}]
["kg CO2 biogénique",{"$f":"C163*1000","v":{"v":0,"d":"0.00"}}]
[]
["Combustion de biométhane (autoconsommation dans tracteurs)"]
[null,"Cultures principales",{"$nulls":3},"CIVES"]
["Biométhane utilisé en tracteur",{"$f":"IF('Données projet'!B68=\"oui\",C172/massevol_biométhane*1000,0)","v":{"v":0,"d":"0.00"}},{"$f":"SUMIF('Données projet substrat'!D6:D1884,\"Cultures principales\",'Données projet substrat'!BR6:BR1884)/1000","v":{"v":0,"d":"0.00"}},null,null,{"$f":"IF('Données projet'!B68=\"oui\",G172/massevol_biométhane*1000,0)","v":{"v":0,"d":"0.00"}},{"$f":"SUMIF('Données projet substrat'!D6:D1884,\"CIVE*\",'Données projet substrat'!BR6:BR1884)/1000","v":{"v":0,"d":"0.00"}}]
["dont CH4",{"$f":"B172*0.97","v":{"v":0,"d":"0.00"}},{"$f":"B173*massevol_CH4/1000","v":{"v":0,"d":"0.00"}},{"$f":"C173*1000*PCI_CH4","v":{"v":0,"d":"0.00"}},{"$f":"D173/3.6","v":{"v":0,"d":"0.00"}},{"$f":"F172*0.97","v":{"v":0,"d":"0.00"}},{"$f":"F173*massevol_CH4/1000","v":{"v":0,"d":"0.00"}},{"$f":"G173*1000*PCI_CH4","v":{"v":0,"d":"0.00"}},{"$f":"H173/3.6","v":{"v":0,"d":"0.00"}}]
["dont CO2",{"$f":"B172-B173","v":{"v":0,"d":"0.00"}},{"$f":"B174*massevol_CO2/1000","v":{"v":0,"d":"0.00"}},null,null,{"$f":"F172-F173","v":{"v":0,"d":"0.00"}},{"$f":"F174*massevol_CO2/1000","v":{"v":0,"d":"0.00"}}]
["% de pertes l'injection dans le réservoir et à l'utilisation",{"$f":"'BDD modélisation ICV'!E42","v":{"v":0.0101,"d":"1.01%"}},{"$nulls":3},{"$f":"'BDD modélisation ICV'!E42","v":{"v":0.0101,"d":"1.01%"}}]
["Pertes de CH4",{"$f":"B173*B175","v":{"v":0,"d":"0.00"}},{"$f":"B176*massevol_CH4/1000","v":{"v":0,"d":"0.00"}},{"$f":"C176*1000*PCI_CH4","v":{"v":0,"d":"0.00"}},{"$f":"D176/3.6","v":{"v":0,"d":"0.00"}},{"$f":"F173*F175","v":{"v":0,"d":"0.00"}},{"$f":"F176*massevol_CH4/1000","v":{"v":0,"d":"0.00"}},{"$f":"G176*1000*PCI_CH4","v":{"v":0,"d":"0.00"}},{"$f":"H176/3.6","v":{"v":0,"d":"0.00"}}]
["Pertes de biométhane (C02)",{"$f":"B174*B175","v":{"v":0,"d":"0.00"}},{"$f":"B177*massevol_CO2/1000","v":{"v":0,"d":"0.00"}},null,null,{"$f":"F174*F175","v":{"v":0,"d":"0.00"}},{"$f":"F177*massevol_CO2/1000","v":{"v":0,"d":"0.00"}}]
["CH4 brûlé en moteur",{"$f":"B173-B176","v":{"v":0,"d":"0.00"}},{"$f":"B178*massevol_CH4/1000","v":{"v":0,"d":"0.00"}},{"$f":"C178*1000*PCI_CH4","v":{"v":0,"d":"0.00"}},{"$f":"D178/3.6","v":{"v":0,"d":"0.00"}},{"$f":"F173-F176","v":{"v":0,"d":"0.00"}},{"$f":"F178*massevol_CH4/1000","v":{"v":0,"d":"0.00"}},{"$f":"G178*1000*PCI_CH4","v":{"v":0,"d":"0.00"}},{"$f":"H178/3.6","v":{"v":0,"d":"0.00"}}]
["kg eq CO2 20 ans",{"$f":"C176*1000*FC_CH4B20","v":{"v":0,"d":"0.00"}},{"$nulls":3},{"$f":"G176*1000*FC_CH4B20","v":{"v":0,"d":"0.00"}}]
["kg eq CO2 100 ans",{"$f":"C176*1000*FC_CH4B100","v":{"v":0,"d":"0.00"}},{"$nulls":3},{"$f":"G176*1000*FC_CH4B100","v":{"v":0,"d":"0.00"}}]
["kg CO2 biogénique",{"$f":"C177*1000+C178*1000*44/16","v":{"v":0,"d":"0.00"}},{"$nulls":3},{"$f":"G177*1000+G178*1000*44/16","v":{"v":0,"d":"0.00"}}]
[]
["Combustion de biométhane (véhicules bioGNV)"]
["Biométhane utilisé en GNV",{"$f":"B164+B165-B172-F172","v":{"v":0,"d":"0.00"}},{"$f":"B184*massevol_biométhane/1000","v":{"v":0,"d":"0.00"}}]
["dont CH4",{"$f":"B184*B121","v":{"v":0,"d":"0.00"}},{"$f":"B185*massevol_CH4/1000","v":{"v":0,"d":"0.00"}},{"$f":"C185*1000*PCI_CH4","v":0},{"$f":"D185/3.6","v":{"v":0,"d":"0.00"}}]
["dont CO2",{"$f":"B184*(1-B121)","v":{"v":0,"d":"0.00"}},{"$f":"B186*massevol_CO2/1000","v":{"v":0,"d":"0.00"}}]
["% de pertes l'injection dans le réservoir et à l'utilisation",{"$f":"'BDD modélisation ICV'!E42","v":{"v":0.0101,"d":"1.01%"}}]
["Pertes de biométhane (CH4)",{"$f":"B185*B187","v":{"v":0,"d":"0.00"}},{"$f":"B188*massevol_CH4/1000","v":{"v":0,"d":"0.00"}},{"$f":"C188*1000*PCI_CH4","v":{"v":0,"d":"0.00"}},{"$f":"D188/3.6","v":{"v":0,"d":"0.00"}}]
["Pertes de biométhane (CO2)",{"$f":"B186*B187","v":{"v":0,"d":"0.00"}},{"$f":"B189*massevol_CO2/1000","v":{"v":0,"d":"0.00"}}]
["CH4 brûlé",{"$f":"B185-B188","v":{"v":0,"d":"0.00"}},{"$f":"B190*massevol_CH4/1000","v":{"v":0,"d":"0.00"}},{"$f":"C190*1000*PCI_CH4","v":{"v":0,"d":"0.00"}},{"$f":"D190/3.6","v":{"v":0,"d":"0.00"}}]
["kg eq CO2 20 ans",{"$f":"C188*1000*FC_CH4B20","v":{"v":0,"d":"0.00"}}]
["kg eq CO2 100 ans",{"$f":"C188*1000*FC_CH4B100","v":{"v":0,"d":"0.00"}}]
["kg CO2 biogénique",{"$f":"C189*1000+C190*1000*44/16","v":{"v":0,"d":"0.00"}}]
[]
["Traitement de l'air (consommation d'eau)"]
["Quantité d'air traité (m3)",{"$f":"IF('Données projet'!B25=\"oui\",B83*'BDD modélisation ICV'!B76,0)","v":0}]
["Consommation d'eau (m3)",{"$f":"B196*'BDD modélisation ICV'!B77","v":{"v":0,"d":"0.00"}}]
["kg eq CO2 20 ans",{"$f":"$B$197*'BDD export Ecoinvent - SIMAPRO'!T8","v":{"v":0,"d":"0.00"}}]
["kg eq CO2 100 ans",{"$f":"$B$197*'BDD export Ecoinvent - SIMAPRO'!T9","v":{"v":0,"d":"0.00"}}]
["Ressources fossiles et nucléaires (kWh eq)",{"$f":"$B$197*'BDD export Ecoinvent - SIMAPRO'!T10","v":{"v":0,"d":"0.00"}}]
[]
["6. Flux d'énergie secondaire",null,null,"Consommation de biométhane par les cultures"]
[]
[null,"Electrique",{"$nulls":9},"Thermique"]
[null,"Broyage","Digestion","Traitement de l'air","Presse à vis","Centrifugeuse","Epuration","Capture et liquéfaction CO2","Injection dans le réseau","Injection en station bioGNV","Auxiliaires (en cas d'installation en cogé)","Hygiénisation","Chauffage digesteur"]
["Consommation unitaire",{"$f":"'BDD modélisation ICV'!B4","v":8},{"$f":"IF('Données projet'!B9=\"cogénération\",'BDD modélisation ICV'!B61,'BDD modélisation ICV'!B44)","v":0.49},{"$f":"'BDD modélisation ICV'!B78","v":1E-3},{"$f":"'BDD modélisation ICV'!B7","v":0.6},{"$f":"'BDD modélisation ICV'!B8","v":1.2},{"$f":"'BDD modélisation ICV'!B39","v":0.35},{"$f":"'BDD modélisation ICV'!B43","v":0.35},{"$f":"'BDD modélisation ICV'!B40","v":0.12},{"$f":"'BDD modélisation ICV'!B42","v":0.267},{"$f":"'BDD modélisation ICV'!D59","v":{"v":0.045,"d":"4.5%"}},{"$f":"'BDD modélisation ICV'!C5","v":170},{"$f":"IF('Données projet'!B9=\"cogénération\",'Données projet'!B72,'BDD modélisation ICV'!B34)","v":{"v":0.06,"d":"6%"}}]
["Unité","kWhe/t de matière entrante","kWhe/Nm3 de CH4 produit","kWh/Nm3 d'air traité","kWhe/t de matière entrante","kWhe/t de matière entrante","kWhe/Nm3 de gaz entrant","kWhe/kg CO2 valorisé","kWhe/Nm3 de gaz entrant","kWhe/kg GNV","% de kWh produits","kWht/t de matière entrante","% de kWh"]
["Quantité entrante",{"$f":"'Données projet substrat'!T4","v":{"v":0,"d":"0.0"}},{"$f":"B80","v":{"v":0,"d":"0.00"}},{"$f":"B196","v":{"v":0,"d":"0.00"}},{"$f":"I5","v":{"v":0,"d":"0.0"}},{"$f":"IF('Données projet'!B87=\"centrifugeuse\",I5,0)","v":{"v":0,"d":"0.0"}},{"$f":"B117","v":{"v":0,"d":"0.00"}},{"$f":"C134","v":{"v":0,"d":"0.00"}},{"$f":"B124+B125","v":{"v":0,"d":"0.00"}},{"$f":"(C164+C165)*1000","v":{"v":0,"d":"0.00"}},{"$f":"IF(B230=0,C230*1000,B230*1000)","v":{"v":0,"d":"0.00"}},{"$f":"'Données projet substrat'!U4","v":{"v":0,"d":"0.0"}},{"$f":"IF('Données projet'!B9=\"cogénération\",B231*1000,E124)","v":{"v":0,"d":"0.0"}}]
["Consommation théorique (kWh)",{"$f":"B206*B208","v":{"v":0,"d":"0.00"}},{"$f":"C206*C208","v":{"v":0,"d":"0.00"}},{"$f":"D206*D208","v":{"v":0,"d":"0.00"}},{"$f":"E206*E208","v":{"v":0,"d":"0.00"}},{"v":0,"d":"0.00"},{"$f":"G206*G208","v":{"v":0,"d":"0.00"}},{"v":0,"d":"0.00"},{"$f":"I206*I208","v":{"v":0,"d":"0.00"}},{"v":0,"d":"0.00"},{"$f":"K206*K208","v":{"v":0,"d":"0.00"}},{"$f":"L206*L208","v":{"v":0,"d":"0.00"}},{"$f":"M206*M208","v":{"v":0,"d":"0.00"}}]
["Cas déclaré: 0=à ne pas prendre en compte; 1=à prendre en compte",{"$f":"IF('Données projet'!B37=\"oui\",0,1)","v":1},0,0,{"$f":"IF('Données projet'!B87=\"presse à vis\",IF('Données projet'!B38=\"Oui\",0,1),0)","v":0},{"$f":"IF('Données projet'!B87=\"centrifugeuse\",IF('Données projet'!B38=\"Oui\",0,1),0)","v":0},0,0,0,0,0,{"$f":"IF('Données projet'!B52=\"Oui\",0,1)","v":1},0]
["Cas calculé: 0=à ne pas prendre en compte; 1=à prendre en compte",1,1,{"$f":"IF('Données projet'!B25=\"Oui\",1,0)","v":0},{"$f":"IF('Données projet'!B87=\"presse à vis\",1,0)","v":0},{"$f":"IF('Données projet'!B87=\"centrifugeuse\",1,0)","v":0},{"$f":"IF('Données projet'!B9=\"Epuration/injection\",1,IF('Données projet'!B56=\"oui\",1,0))","v":0},{"$f":"IF('Données projet'!B63=\"Oui\",1,0)","v":0},{"$f":"IF('Données projet'!B9=\"Epuration/injection\",1,IF('Données projet'!B56=\"oui\",1,0))","v":0},{"$f":"IF('Données projet'!B68=\"Oui\",1,0)","v":0},{"$f":"IF('Données projet'!B9=\"cogénération\",1,0)","v":0},1,1]
["kg eq CO2 20 ans",{"$f":"B209*('Données projet'!$B$29*'BDD export Ecoinvent - SIMAPRO'!$R$8+'Données projet'!$B$35*'BDD export Ecoinvent - SIMAPRO'!$S$8)","v":{"v":0,"d":"0.00"}},{"$f":"C209*('Données projet'!$B$29*'BDD export Ecoinvent - SIMAPRO'!$R$8+'Données projet'!$B$35*'BDD export Ecoinvent - SIMAPRO'!$S$8)","v":{"v":0,"d":"0.00"}},{"$f":"D209*('Données projet'!$B$29*'BDD export Ecoinvent - SIMAPRO'!$R$8+'Données projet'!$B$35*'BDD export Ecoinvent - SIMAPRO'!$S$8)","v":{"v":0,"d":"0.00"}},{"$f":"E209*('Données projet'!$B$29*'BDD export Ecoinvent - SIMAPRO'!$R$8+'Données projet'!$B$35*'BDD export Ecoinvent - SIMAPRO'!$S$8)","v":{"v":0,"d":"0.00"}},{"$f":"F209*('Données projet'!$B$29*'BDD export Ecoinvent - SIMAPRO'!$R$8+'Données projet'!$B$35*'BDD export Ecoinvent - SIMAPRO'!$S$8)","v":{"v":0,"d":"0.00"}},{"$f":"G209*('Données projet'!$B$29*'BDD export Ecoinvent - SIMAPRO'!$R$8+'Données projet'!$B$35*'BDD export Ecoinvent - SIMAPRO'!$S$8)","v":{"v":0,"d":"0.00"}},{"$f":"H209*('Données projet'!$B$29*'BDD export Ecoinvent - SIMAPRO'!$R$8+'Données projet'!$B$35*'BDD export Ecoinvent - SIMAPRO'!$S$8)","v":{"v":0,"d":"0.00"}},{"$f":"I209*('Données projet'!$B$29*'BDD export Ecoinvent - SIMAPRO'!$R$8+'Données projet'!$B$35*'BDD export Ecoinvent - SIMAPRO'!$S$8)","v":{"v":0,"d":"0.00"}},{"$f":"J209*('Données projet'!$B$29*'BDD export Ecoinvent - SIMAPRO'!$R$8+'Données projet'!$B$35*'BDD export Ecoinvent - SIMAPRO'!$S$8)","v":{"v":0,"d":"0.00"}},{"$f":"K209*('Données projet'!$B$29*'BDD export Ecoinvent - SIMAPRO'!$R$8+'Données projet'!$B$35*'BDD export Ecoinvent - SIMAPRO'!$S$8)","v":{"v":0,"d":"0.00"}},{"$f":"L209*'Données projet'!$B$41*'BDD export Ecoinvent - SIMAPRO'!$M$8","v":{"v":0,"d":"0.00"}},{"$f":"IF('Données projet'!B9=\"cogénération\",0,IF('Données projet'!B59=\"oui\",0,M209*'Données projet'!B41*'BDD export Ecoinvent - SIMAPRO'!N8))","v":{"v":0,"d":"0.00"}}]
["kg eq CO2 100 ans",{"$f":"B209*('Données projet'!$B$29*'BDD export Ecoinvent - SIMAPRO'!$R$9+'Données projet'!$B$35*'BDD export Ecoinvent - SIMAPRO'!$S$9)","v":{"v":0,"d":"0.00"}},{"$f":"C209*('Données projet'!$B$29*'BDD export Ecoinvent - SIMAPRO'!$R$9+'Données projet'!$B$35*'BDD export Ecoinvent - SIMAPRO'!$S$9)","v":{"v":0,"d":"0.00"}},{"$f":"D209*('Données projet'!$B$29*'BDD export Ecoinvent - SIMAPRO'!$R$9+'Données projet'!$B$35*'BDD export Ecoinvent - SIMAPRO'!$S$9)","v":{"v":0,"d":"0.00"}},{"$f":"E209*('Données projet'!$B$29*'BDD export Ecoinvent - SIMAPRO'!$R$9+'Données projet'!$B$35*'BDD export Ecoinvent - SIMAPRO'!$S$9)","v":{"v":0,"d":"0.00"}},{"$f":"F209*('Données projet'!$B$29*'BDD export Ecoinvent - SIMAPRO'!$R$9+'Données projet'!$B$35*'BDD export Ecoinvent - SIMAPRO'!$S$9)","v":{"v":0,"d":"0.00"}},{"$f":"G209*('Données projet'!$B$29*'BDD export Ecoinvent - SIMAPRO'!$R$9+'Données projet'!$B$35*'BDD export Ecoinvent - SIMAPRO'!$S$9)","v":{"v":0,"d":"0.00"}},{"$f":"H209*('Données projet'!$B$29*'BDD export Ecoinvent - SIMAPRO'!$R$9+'Données projet'!$B$35*'BDD export Ecoinvent - SIMAPRO'!$S$9)","v":{"v":0,"d":"0.00"}},{"$f":"I209*('Données projet'!$B$29*'BDD export Ecoinvent - SIMAPRO'!$R$9+'Données projet'!$B$35*'BDD export Ecoinvent - SIMAPRO'!$S$9)","v":{"v":0,"d":"0.00"}},{"$f":"J209*('Données projet'!$B$29*'BDD export Ecoinvent - SIMAPRO'!$R$9+'Données projet'!$B$35*'BDD export Ecoinvent - SIMAPRO'!$S$9)","v":{"v":0,"d":"0.00"}},{"$f":"K209*('Données projet'!$B$29*'BDD export Ecoinvent - SIMAPRO'!$R$9+'Données projet'!$B$35*'BDD export Ecoinvent - SIMAPRO'!$S$9)","v":{"v":0,"d":"0.00"}},{"$f":"L209*'Données projet'!$B$41*'BDD export Ecoinvent - SIMAPRO'!$M$9","v":{"v":0,"d":"0.00"}},{"$f":"IF('Données projet'!B9=\"cogénération\",0,IF('Données projet'!B59=\"oui\",0,M209*'Données projet'!B41*'BDD export Ecoinvent - SIMAPRO'!N9))","v":{"v":0,"d":"0.00"}}]
["Ressources fossiles et nucléaires (kWh eq)",{"$f":"B209*('Données projet'!$B$29*'BDD export Ecoinvent - SIMAPRO'!$R$10+'Données projet'!$B$35*'BDD export Ecoinvent - SIMAPRO'!$S$10)","v":{"v":0,"d":"0.00"}},{"$f":"C209*('Données projet'!$B$29*'BDD export Ecoinvent - SIMAPRO'!$R$10+'Données projet'!$B$35*'BDD export Ecoinvent - SIMAPRO'!$S$10)","v":{"v":0,"d":"0.00"}},{"$f":"D209*('Données projet'!$B$29*'BDD export Ecoinvent - SIMAPRO'!$R$10+'Données projet'!$B$35*'BDD export Ecoinvent - SIMAPRO'!$S$10)","v":{"v":0,"d":"0.00"}},{"$f":"E209*('Données projet'!$B$29*'BDD export Ecoinvent - SIMAPRO'!$R$10+'Données projet'!$B$35*'BDD export Ecoinvent - SIMAPRO'!$S$10)","v":{"v":0,"d":"0.00"}},{"$f":"F209*('Données projet'!$B$29*'BDD export Ecoinvent - SIMAPRO'!$R$10+'Données projet'!$B$35*'BDD export Ecoinvent - SIMAPRO'!$S$10)","v":{"v":0,"d":"0.00"}},{"$f":"G209*('Données projet'!$B$29*'BDD export Ecoinvent - SIMAPRO'!$R$10+'Données projet'!$B$35*'BDD export Ecoinvent - SIMAPRO'!$S$10)","v":{"v":0,"d":"0.00"}},{"$f":"H209*('Données projet'!$B$29*'BDD export Ecoinvent - SIMAPRO'!$R$10+'Données projet'!$B$35*'BDD export Ecoinvent - SIMAPRO'!$S$10)","v":{"v":0,"d":"0.00"}},{"$f":"I209*('Données projet'!$B$29*'BDD export Ecoinvent - SIMAPRO'!$R$10+'Données projet'!$B$35*'BDD export Ecoinvent - SIMAPRO'!$S$10)","v":{"v":0,"d":"0.00"}},{"$f":"J209*('Données projet'!$B$29*'BDD export Ecoinvent - SIMAPRO'!$R$10+'Données projet'!$B$35*'BDD export Ecoinvent - SIMAPRO'!$S$10)","v":{"v":0,"d":"0.00"}},{"$f":"K209*('Données projet'!$B$29*'BDD export Ecoinvent - SIMAPRO'!$R$10+'Données projet'!$B$35*'BDD export Ecoinvent - SIMAPRO'!$S$10)","v":{"v":0,"d":"0.00"}},{"$f":"L209*'Données projet'!$B$41*'BDD export Ecoinvent - SIMAPRO'!$M$10","v":{"v":0,"d":"0.00"}},{"$f":"IF('Données projet'!B9=\"cogénération\",0,IF('Données projet'!B59=\"oui\",0,M209*'Données projet'!B41*'BDD export Ecoinvent - SIMAPRO'!N10))","v":{"v":0,"d":"0.00"}}]
[]
["Consommations de l'installation (en cogénération ou en épuration/injection)"]
["Paramètres"]
["Electricité (consommation)",{"$f":"IF('Données projet'!B36=0,0,1)","v":0},{"$f":"1-B218","v":1}]
["Chaleur (consommation)",{"$f":"IF('Données projet'!B51=0,0,1)","v":0},{"$f":"1-B219","v":1}]
["Electricité (production)",{"$f":"IF('Valorisation du biogaz'!D21=0,0,1)","v":0},{"$f":"1-B220","v":1}]
["Chaleur (production)",{"$f":"IF('Valorisation du biogaz'!D24=0,0,1)","v":0},{"$f":"1-B221","v":1}]
["Biométhane (production)",{"$f":"IF('Valorisation du biogaz'!D28=0,0,1)","v":0},{"$f":"1-B222","v":1}]
[]
[null,"Déclaré","Calculé",null,"COMMENTAIRES"]
[null,"MWh","MWh"]
["Production de biométhane (injection réseau)",{"$f":"IF('Données projet'!B9=\"Epuration/injection\",'Données projet'!B67*(1-'Données projet'!B69),0)","v":{"v":0,"d":"0.00"}},{"$f":"IF('Données projet'!B9=\"Epuration/injection\",E142/1000,0)","v":{"v":0,"d":"0.00"}},"Si épuration/injection"]
["Production de bioGNV",{"$f":"IF('Données projet'!B9=\"Epuration/injection\",'Données projet'!B67*'Données projet'!B69,0)","v":{"v":0,"d":"0.00"}},{"$f":"IF('Données projet'!B9=\"Epuration/injection\",E164/1000,0)","v":{"v":0,"d":"0.00"}}]
["Autoconsommation bioGNV",{"$f":"IF('Données projet'!B9=\"Epuration/injection\",(E173+I173+B63*'BDD modélisation ICV'!A177*'BDD modélisation ICV'!G138)/1000,0)","v":{"v":0,"d":"0.00"}},{"$f":"IF('Données projet'!B9=\"Epuration/injection\",(E173+I173+B63*'BDD modélisation ICV'!A177*'BDD modélisation ICV'!G138)/1000,0)","v":{"v":0,"d":"0.00"}}]
["Production bioGNV exédentaire",{"$f":"IF(B227-B228<0,0,B227-B228)","v":{"v":0,"d":"0.00"}},{"$f":"IF(C227-C228<0,0,C227-C228)","v":{"v":0,"d":"0.00"}}]
["Production électrique brute",{"$f":"'Données projet'!B65","v":{"v":0,"d":"0.00"}},{"$f":"IF('Données projet'!B9=\"cogénération\",'Données projet'!B53*E106/1000,'Données projet'!B53*E115/1000)","v":{"v":0,"d":"0.00"}},"Si présence cogé"]
["Production thermique brute",{"$f":"'Données projet'!B66","v":{"v":0,"d":"0.00"}},{"$f":"IF('Données projet'!B9=\"cogénération\",'Données projet'!B54*E106/1000,'Données projet'!B54*E115/1000)","v":{"v":0,"d":"0.00"}}]
["Consommations électriques",{"$f":"'Données projet'!B36+(SUMPRODUCT(B209:K209,B210:K210)/1000)","v":{"v":0,"d":"0.00"}},{"$f":"SUMPRODUCT(B209:K209,B211:K211)/1000","v":{"v":0,"d":"0.00"}}]
["Consommations thermiques",{"$f":"'Données projet'!B51+(SUMPRODUCT(L209:M209,L210:M210)/1000)","v":{"v":0,"d":"0.00"}},{"$f":"SUMPRODUCT(L209:M209,L211:M211)/1000","v":{"v":0,"d":"0.00"}}]
["Autoconsommation électrique",{"$f":"'Données projet'!B31","v":{"v":0,"d":"0.00"}},{"$f":"'Données projet'!B70*C230","v":{"v":0,"d":"0.00"}}]
["Autoconsommation thermique",{"$f":"'Données projet'!B43","v":{"v":0,"d":"0.00"}},{"$f":"'Données projet'!B72*C231","v":{"v":0,"d":"0.00"}}]
["Electricité vendue",{"$f":"'Données projet'!B71*B230","v":{"v":0,"d":"0.00"}},{"$f":"'Données projet'!B71*C230","v":{"v":0,"d":"0.00"}}]
["Chaleur vendue",{"$f":"B231*'Données projet'!B73","v":{"v":0,"d":"0.00"}},{"$f":"C231*'Données projet'!B73","v":{"v":0,"d":"0.00"}}]
["kg eq CO2 20 ans",{"$f":"B232*1000*('Données projet'!$B$29*'BDD export Ecoinvent - SIMAPRO'!$R$8+'Données projet'!$B$35*'BDD export Ecoinvent - SIMAPRO'!$S$8)+B233*1000*('Données projet'!$B$41*'BDD export Ecoinvent - SIMAPRO'!$M$8)","v":{"v":0,"d":"0.00"}},{"$f":"SUMPRODUCT(B211:M211,B212:M212)","v":{"v":0,"d":"0.00"}}]
["kg eq CO2 100 ans",{"$f":"B232*1000*('Données projet'!$B$29*'BDD export Ecoinvent - SIMAPRO'!$R$9+'Données projet'!$B$35*'BDD export Ecoinvent - SIMAPRO'!$S$9)+B233*1000*('Données projet'!$B$41*'BDD export Ecoinvent - SIMAPRO'!$M$9)","v":{"v":0,"d":"0.00"}},{"$f":"SUMPRODUCT(B211:M211,B213:M213)","v":{"v":0,"d":"0.00"}}]
["Ressources fossiles et nucléaires (kWh eq)",{"$f":"B232*1000*('Données projet'!$B$29*'BDD export Ecoinvent - SIMAPRO'!$R$10+'Données projet'!$B$35*'BDD export Ecoinvent - SIMAPRO'!$S$10)+B233*1000*('Données projet'!$B$41*'BDD export Ecoinvent - SIMAPRO'!$M$10)","v":{"v":0,"d":"0.00"}},{"$f":"SUMPRODUCT(B211:M211,B214:M214)","v":{"v":0,"d":"0.00"}}]
[]
["7. Substitutions (émissions évitées grâce à la méthanisation)"]
["Substitution à la consommation de diesel des CIPAN"]
["Substitution de diesel (kg)",{"$f":"'Données projet substrat'!BF4","v":{"v":0,"d":"0.00"}}]
["kg eq CO2 20 ans",{"$f":"$B$244*('BDD export Ecoinvent - SIMAPRO'!D8+'BDD export Ecoinvent - SIMAPRO'!E8)","v":{"v":0,"d":"0.00"}}]
["kg eq CO2 100 ans",{"$f":"$B$244*('BDD export Ecoinvent - SIMAPRO'!D9+'BDD export Ecoinvent - SIMAPRO'!E9)","v":{"v":0,"d":"0.00"}}]
["Ressources fossiles et nucléaires (kWh eq)",{"$f":"$B$244*('BDD export Ecoinvent - SIMAPRO'!D10+'BDD export Ecoinvent - SIMAPRO'!E10)","v":{"v":0,"d":"0.00"}}]
["Substitution aux traitements de déchets"]
["kg eq CO2 20 ans",{"$f":"'Données projet substrat'!CP4","v":{"v":0,"d":"0.00"}}]
["kg eq CO2 100 ans",{"$f":"'Données projet substrat'!CQ4","v":{"v":0,"d":"0.00"}}]
["Ressources fossiles et nucléaires (kWh eq)",{"$f":"'Données projet substrat'!CR4","v":{"v":0,"d":"0.00"}}]
["Substitution de t.km",{"$f":"'Données projet substrat'!CK4","v":{"v":0,"d":"0.00"}}]
["kg eq CO2 20 ans",{"$f":"B252*'BDD export Ecoinvent - SIMAPRO'!F8","v":{"v":0,"d":"0.00"}}]
["kg eq CO2 100 ans",{"$f":"B252*'BDD export Ecoinvent - SIMAPRO'!F9","v":{"v":0,"d":"0.00"}}]
["Ressources fossiles et nucléaires (kWh eq)",{"$f":"B252*'BDD export Ecoinvent - SIMAPRO'!F10","v":{"v":0,"d":"0.00"}}]
["Substitution de CO2"]
["Substitution de t.km",{"$f":"C134*500","v":{"v":0,"d":"0.00"}},"base de 500km évités"]
["kg eq CO2 20 ans",{"$f":"B257*'BDD export Ecoinvent - SIMAPRO'!F8","v":{"v":0,"d":"0.00"}}]
["kg eq CO2 100 ans",{"$f":"B257*'BDD export Ecoinvent - SIMAPRO'!F9","v":{"v":0,"d":"0.00"}}]
["Ressources fossiles et nucléaires (kWh eq)",{"$f":"B257*'BDD export Ecoinvent - SIMAPRO'!F10","v":{"v":0,"d":"0.00"}}]
["Substitution d'énergie"]
["Substitution à la production de gaz (injection réseau de biométhane) (kg)",{"$f":"B222*B226*'BDD modélisation ICV'!A158*(1-B71)+C222*(C151+C152)*1000","v":{"v":0,"d":"0.00"}},"GN"]
["Substitution à la production de diesel (injection station de bioGNV) (kg)",{"$f":"B222*B229*'BDD modélisation ICV'!A158*(1-B71)+C222*C184*1000","v":{"v":0,"d":"0.00"}},"carburant pétro-sourcé (diesel), hors utilisation dans le tracteur (\"autoconsommation\")"]
["kg eq CO2 20 ans",{"$f":"B262*'BDD export Ecoinvent - SIMAPRO'!N8+B263*('BDD export Ecoinvent - SIMAPRO'!E8+'BDD export Ecoinvent - SIMAPRO'!D8)","v":{"v":0,"d":"0.00"}}]
["kg eq CO2 100 ans",{"$f":"B262*'BDD export Ecoinvent - SIMAPRO'!N9+B263*('BDD export Ecoinvent - SIMAPRO'!E9+'BDD export Ecoinvent - SIMAPRO'!D9)","v":{"v":0,"d":"0.00"}}]
["Ressources fossiles et nucléaires (kWh eq)",{"$f":"B262*'BDD export Ecoinvent - SIMAPRO'!N10+B263*('BDD export Ecoinvent - SIMAPRO'!E10+'BDD export Ecoinvent - SIMAPRO'!D10)","v":{"v":0,"d":"0.00"}}]
["Substitution à la production d'électricité (kWh)",{"$f":"B220*B236*1000*(1-B71)+C220*C236*1000","v":{"v":0,"d":"0.00"}},"mix électrique français (high voltage)"]
["kg eq CO2 20 ans",{"$f":"B267*'BDD export Ecoinvent - SIMAPRO'!Q8","v":{"v":0,"d":"0.00"}}]
["kg eq CO2 100 ans",{"$f":"B267*'BDD export Ecoinvent - SIMAPRO'!Q9","v":{"v":0,"d":"0.00"}}]
["Ressources fossiles et nucléaires (kWh eq)",{"$f":"B267*'BDD export Ecoinvent - SIMAPRO'!Q10","v":{"v":0,"d":"0.00"}}]
["Substitution à la production de chaleur (kWh)",{"$f":"B221*B237*1000*(1-B71)+C221*C237*1000","v":{"v":0,"d":"0.00"}},"GN","à revoir: comptabiliser la chaleur produite qui est exploitée et consommée sur place"]
["kg eq CO2 20 ans",{"$f":"B271*'BDD export Ecoinvent - SIMAPRO'!M8","v":{"v":0,"d":"0.00"}}]
["kg eq CO2 100 ans",{"$f":"B271*'BDD export Ecoinvent - SIMAPRO'!M9","v":{"v":0,"d":"0.00"}}]
["Ressources fossiles et nucléaires (kWh eq)",{"$f":"B271*'BDD export Ecoinvent - SIMAPRO'!M10","v":{"v":0,"d":"0.00"}}]
["Substitution d'engrais"]
[null,"N (kg) - exporté par le digestat et capté par les légumineuses cultivées en mélange de CIVES","P2O5 (kg) - exporté","K2O (kg) - exporté"]
["kg d'équivalent fertilisant évité production",{"$f":"SUM(Z22:AB22)+'Données projet substrat'!CA4","v":{"v":0,"d":"0.00"}},{"$f":"SUM(Z22:AB22)","v":0},{"$f":"SUM(Z23:AB23)","v":0}]
["kg eq CO2 20 ans",{"$f":"B277*'BDD export Ecoinvent - SIMAPRO'!$G$8","v":0},{"$f":"C277*'BDD export Ecoinvent - SIMAPRO'!$H$8","v":0},{"$f":"D277*'BDD export Ecoinvent - SIMAPRO'!$I$8","v":0}]
["kg eq CO2 100 ans",{"$f":"B278*'BDD export Ecoinvent - SIMAPRO'!$G$9","v":0},{"$f":"C278*'BDD export Ecoinvent - SIMAPRO'!$H$9","v":0},{"$f":"D278*'BDD export Ecoinvent - SIMAPRO'!$I$9","v":0}]
["Ressources fossiles et nucléaires (kWh eq)",{"$f":"B279*'BDD export Ecoinvent - SIMAPRO'!$G$10","v":0},{"$f":"C279*'BDD export Ecoinvent - SIMAPRO'!$H$10","v":0},{"$f":"D279*'BDD export Ecoinvent - SIMAPRO'!$I$10","v":0}]
[]
["Emissions de NH3 et NOx (IPCC, 2019)",{"$f":"B277*'BDD modélisation ICV'!$E$109","v":0}]
["Emissions de N2O indirect (via NH3 et Nox)",{"$f":"B282*'BDD modélisation ICV'!$E$110","v":0}]
[]
["Lessivage de N-NO3-",{"$f":"B277*'BDD modélisation ICV'!$E$111","v":0}]
["Emissions de N-N2O indirect (via NO3-)",{"$f":"B285*'BDD modélisation ICV'!$E$112","v":0}]
[]
["Emissions directes de N-N2O",{"$f":"B277*'BDD modélisation ICV'!$E$113","v":0}]
[]
["Emissions totales de N-N2O",{"$f":"B283+B286+B288","v":0}]
["kg eq CO2 20 ans",{"$f":"B290/28*44*FC_N2O20","v":0}]
["kg eq CO2 100 ans",{"$f":"B290/28*44*FC_N2O100","v":0}]
[]
[]
["Nombre d'hectare fertilisé en azote à une dose de 170 UN / ha",{"$f":"B277/170","v":0}]
["L de diesel non consommé pour l'azote minéral",{"$f":"B295*'BDD ITK culture'!$I$13","v":0}]
["kg de diesel non consommé pour l'azote minéral",{"$f":"B296*'BDD modélisation ICV'!$A$135","v":0}]
["kg eq CO2 20 ans",{"$f":"B297*('BDD export Ecoinvent - SIMAPRO'!$D$8+'BDD export Ecoinvent - SIMAPRO'!$E$8)","v":0}]
["kg eq CO2 100 ans",{"$f":"B297*('BDD export Ecoinvent - SIMAPRO'!$D$9+'BDD export Ecoinvent - SIMAPRO'!$E$9)","v":0}]
["Ressources fossiles et nucléaires (kWh eq)",{"$f":"B297*('BDD export Ecoinvent - SIMAPRO'!$D$10+'BDD export Ecoinvent - SIMAPRO'!$E$10)","v":0}]
[]
["Total des substitutions d'engrais minéraux (avec émissions à l'épandage et travail au champ)"]
["kg eq CO2 20 ans",{"$f":"SUM(B278:D278+B291+B298)","v":0}]
["kg eq CO2 100 ans",{"$f":"SUM(B279:D279+B292+B299)","v":0}]
["Ressources fossiles et nucléaires (kWh eq)",{"$f":"SUM(B280:D280+B300)","v":0}]
[]
["Résultats azote"]
["Catégories","Tonnes d'azote total /an"]
["Lisier",{"$f":"SUMIF('Données projet substrat'!$F$6:$F$14,A309,'Données projet substrat'!$AR$6:$AR$14)/1000","v":{"v":0,"d":"0.00"}}]
["Fumier",{"$f":"SUMIF('Données projet substrat'!$F$6:$F$14,A310,'Données projet substrat'!$AR$6:$AR$14)/1000","v":{"v":0,"d":"0.00"}}]
["Cultures dédiées",{"$f":"SUMIF('Données projet substrat'!$F$6:$F$14,A311,'Données projet substrat'!$AR$6:$AR$14)/1000","v":{"v":0,"d":"0.00"}}]
["CIVES",{"$f":"SUMIF('Données projet substrat'!$F$6:$F$14,A312,'Données projet substrat'!$AR$6:$AR$14)/1000","v":{"v":0,"d":"0.00"}}]
["Déchets/Résidus de cultures/Cultures dédiées déclassées",{"$f":"SUMIF('Données projet substrat'!$F$6:$F$14,A313,'Données projet substrat'!$AR$6:$AR$14)/1000","v":{"v":0,"d":"0.00"}}]
["Déchets/Résidus de collectivité",{"$f":"SUMIF('Données projet substrat'!$F$6:$F$14,A314,'Données projet substrat'!$AR$6:$AR$14)/1000","v":{"v":0,"d":"0.00"}}]
["Déchets de STEU",{"$f":"SUMIF('Données projet substrat'!$F$6:$F$14,A315,'Données projet substrat'!$AR$6:$AR$14)/1000","v":{"v":0,"d":"0.00"}}]
["Déchets d'industrie (IAA animales)",{"$f":"SUMIF('Données projet substrat'!$F$6:$F$14,A316,'Données projet substrat'!$AR$6:$AR$14)/1000","v":{"v":0,"d":"0.00"}}]
["Déchets d'industrie (IAA végétales)",{"$f":"SUMIF('Données projet substrat'!$F$6:$F$14,A317,'Données projet substrat'!$AR$6:$AR$14)/1000","v":{"v":0,"d":"0.00"}}]
["Déchets d'industrie (IAA autres)",{"$f":"SUMIF('Données projet substrat'!$F$6:$F$14,A318,'Données projet substrat'!$AR$6:$AR$14)/1000","v":{"v":0,"d":"0.00"}}]
["Total",{"$f":"SUM(B309:B318)","v":{"v":0,"d":"0.00"}}]
[null,"Tonnes d'UN/an"]
["Part d'azote minéralisé et valorisé sur des cultures principales",{"$f":"SUMIF('Données projet substrat'!$D$6:$D$14,\"Culture principale\",'Données projet substrat'!$CD$6:$CD$14)/1000","v":{"v":0,"d":"0.00"}}]
["Part d'azote minéralisé et valorisé sur des CIVE",{"$f":"SUMIF('Données projet substrat'!$D$6:$D$14,\"CIVE*\",'Données projet substrat'!$CD$6:$CD$14)/1000","v":{"v":0,"d":"0.00"}}]
["Part d'azote minéralisé et exporté",{"$f":"SUM('Calculs fonctionnement'!Z22:AB22)/1000","v":{"v":0,"d":"0.00"}}]
["Part d'azote organique épandu mais non minéralisé",{"$f":"(U7-Z7)/1000","v":{"v":0,"d":"0.00"}}]
["Part émise sous forme de NH3",{"$f":"U25/1000","v":{"v":0,"d":"0.00"}}]
["Part émise sous forme de N2O",{"$f":"U26/1000","v":{"v":0,"d":"0.00"}}]
["Part émise sous forme de NO3-",{"$f":"U27/1000","v":{"v":0,"d":"0.00"}}]
["Total",{"$f":"SUM(B321:B327)","v":{"v":0,"d":"0.00"}}]
["Calcul V"]
[{"$f":"(B220*(B230-B234)+C220*(C230-C234)+B222*B226+C222*C226+B221*(B231-B235)+C221*(C231-C235)+B222*B229+C222*C229)","v":0},{"$f":"IF(A330/A331>1,1,A330/A331)","v":{"$error":"#DIV/0!"}}]
[{"$f":"E80/1000","v":0}]
[]
["TRE"]
[{"$f":"B222*(B226+B229)+B220*(B230-B234)+B221*(B231-B235)+C222*(C226+C229)+C220*(C230-C234)+C221*(C231-C235)","v":{"v":0,"d":"0.00"}},{"$f":"A334/A335","v":{"$error":"#DIV/0!"}}]
[{"$f":"B218*B232*('Données projet'!$B$29*'BDD export Ecoinvent - SIMAPRO'!$R$10+'Données projet'!$B$35*'BDD export Ecoinvent - SIMAPRO'!$S$10)+B219*B233*'Données projet'!$B$41*'BDD export Ecoinvent - SIMAPRO'!$M$10+C218*C232*('Données projet'!$B$29*'BDD export Ecoinvent - SIMAPRO'!$R$10+'Données projet'!$B$35*'BDD export Ecoinvent - SIMAPRO'!$S$10)+C219*C233*'Données projet'!$B$41*'BDD export Ecoinvent - SIMAPRO'!$M$10+B228*B222+C228*C222+(B36+C36+B43+C43+B56+C56+B62+B200+F88)/1000","v":0}]

{"sheet":"Résultats","index":15,"n_rows":47,"n_cols":9,"rows_kept":47,"hidden":true}
[]
[]
[]
[null,null,"Par indicateur"]
[null,null,"Chiffre --> désagrégé (surtout stockage de carbone)"]
[null,null,"Histo"]
[null,null,"Sankey ?"]
[{"$nulls":3},"Résultat changement climatique",null,"résultats déagrégés","émis","évités"]
[{"$nulls":3},"à 20 ans et 100 ans",null,null,"production substrats"]
[{"$nulls":6},"stockage de carbone dans les sols"]
[{"$nulls":3},"En histogramme",null,null,"transport","transport évité"]
[{"$nulls":6},"prétraitement"]
[{"$nulls":6},"digestion","évitement traitement de référence"]
[{"$nulls":6},"valorisation biogaz","évitement énergie"]
[{"$nulls":6},"transport digestat"]
[{"$nulls":6},"épandage digestat","évitement engrais"]
[]
[{"$nulls":5},"résultats agrégés","émis","évités","Stockage de carbone"]
[{"$nulls":5},"cibler les étapes contributrices, proposer une listes d’actions correctives "]
[]
[{"$nulls":5},"émussion fugitive d'inversion des bénéfices"]
[]
[]
[{"$nulls":3},"Résultats indicateur énergie",null,"résultats déagrégés","émis","évités"]
[{"$nulls":6},"production substrats"]
[{"$nulls":3},"En histogramme",null,null,"transport","transport évité"]
[{"$nulls":6},"prétraitement"]
[{"$nulls":6},"digestion","évitement traitement de référence"]
[{"$nulls":6},"valorisation biogaz","évitement énergie"]
[{"$nulls":6},"transport digestat"]
[{"$nulls":6},"épandage digestat","évitement engrais"]
[]
[{"$nulls":5},"résultats agrégés","émis","évités"]
[{"$nulls":5},"cibler les étapes contributrices, proposer une listes d’actions correctives "]
[]
[{"$nulls":5},"ratio entre production d'énergie de l'unité et sa consommation d'énergie sur une année"]
[{"$nulls":5},"kWh valorisés : électricité, thermique biogaz/biométhane, kWh compressé pour le transport"]
[{"$nulls":5},"kWh consommé : tracteur (diesel et biométhane), diesel transport, élec et GN thermique provenant d'une source exterieur à l'unité"]
[]
[{"$nulls":3},"Résultats indicateur azote"]
[]
[]
[]
[]
[]
[]
[{"$nulls":3},"Résultats d'indicateur d'économie cicrulaire et de bonnes pratiques"]

{"sheet":"Calculs d'impacts","index":16,"n_rows":70,"n_cols":45,"rows_kept":70,"hidden":true,"merged":[[22,1,22,2],[22,6,22,9],[22,10,22,13],[22,14,22,15],[22,17,22,18],[22,19,22,21],[22,22,22,23],[22,24,22,29],[22,30,22,38],[22,39,22,44],[32,1,32,2],[42,1,42,2]]}
{"$rows_empty":21}
[null,"1) Résultats détaillés pour chaque poste",{"$nulls":16},"Conso thermique déclaré ?",{"$nulls":20},"séparer diesel/bioGNV/biométhane/elec/chaleur"]
[null,"Stockage de carbone par les CIVE",{"$nulls":4},"Impacts des substrats cultivés (cultures principales)",{"$nulls":3},"Impacts des substrats cultivés (CIVE)",{"$nulls":3},"Stockage des effluents bruts",null,"Transport","Pré-traitements",null,"Digestion",null,null,"Cogénération",null,"Valorisation en biométhane",{"$nulls":5},"Gestion du digestat",{"$nulls":8},"Emissions évités par les substitutions"]
[{"$nulls":6},"Production et combustion du carburant","Fertilisation minérale","Fertilisation organique","Traitement phytosanitaire","Production et combustion du carburant","Fertilisation minérale","Fertilisation organique","Traitement phytosanitaire","Fumiers","Lisiers","Transport des substrats","Broyage","Hygiénisation","Digesteur","Torchère et traitement des airs viciés","Emissions Fugitives Structurelle","Auxiliaire","Imbrulés de combustion en cogénératrice","Epuration","Capture et liquéfaction CO2","Injection","Combustion en chaudière","Injection en station bioGNV","Imbrûlé de combustion en moteur de véhicule","Presse à vis","Centrifugeuse","Stockage du digestat brut","Stockage du digestat liquide","Stockage du digestat solide","Epandage du digestat brut","Epandage du digestat liquide","Epandage du digestat solide","Transport du digestat","Evitées par la substitution de diesel de la culture CIPAN par les CIVE","Evitées par la substitution d'énergie","Evitées par la substitution de traitement de déchets et d'effluents","Evitées par la substitution de transport de déchets","Evitées par la substitution d'engrais","Evitées par la production de CO2 biogénique (évitement du transport de CO2 fossile)"]
[null,"t C 20 ans",{"$f":"'Données projet substrat'!BV4","v":{"v":0,"d":"0.00"}},null,"GES émis","kg eq CO2 20 ans",{"$f":"'Calculs fonctionnement'!B27+'Calculs fonctionnement'!B34+'Calculs fonctionnement'!B179","v":{"v":0,"d":"0.00"}},{"$f":"'Calculs fonctionnement'!B41","v":{"v":0,"d":"0.00"}},{"$f":"'Calculs fonctionnement'!B48","v":{"v":0,"d":"0.00"}},{"$f":"'Calculs fonctionnement'!B54","v":{"v":0,"d":"0.00"}},{"$f":"'Calculs fonctionnement'!D27+'Calculs fonctionnement'!C34+'Calculs fonctionnement'!F179","v":{"v":0,"d":"0.00"}},{"$f":"'Calculs fonctionnement'!C41","v":{"v":0,"d":"0.00"}},{"$f":"'Calculs fonctionnement'!C48","v":{"v":0,"d":"0.00"}},{"$f":"'Calculs fonctionnement'!C54","v":{"v":0,"d":"0.00"}},{"$f":"SUMIF('Données projet substrat'!F6:F14,\"Fumier\",'Données projet substrat'!CH6:CH14)","v":{"v":0,"d":"0.00"}},{"$f":"SUMIF('Données projet substrat'!F6:F14,\"Lisier\",'Données projet substrat'!CH6:CH14)","v":{"v":0,"d":"0.00"}},{"$f":"'Calculs fonctionnement'!B60","v":{"v":0,"d":"0.00"}},{"$f":"'Calculs fonctionnement'!C218*'Calculs fonctionnement'!B212","v":{"v":0,"d":"0.00"}},{"$f":"'Calculs fonctionnement'!C219*'Calculs fonctionnement'!L211*'Calculs fonctionnement'!L212","v":{"v":0,"d":"0.00"}},{"$f":"IF('Calculs fonctionnement'!B218=1,'Calculs fonctionnement'!B238,'Calculs fonctionnement'!C212*'Calculs fonctionnement'!C211+'Calculs fonctionnement'!C219*'Calculs fonctionnement'!M212)+'Calculs fonctionnement'!F86","v":{"v":0,"d":"0.00"}},{"$f":"'Calculs fonctionnement'!B95+'Calculs fonctionnement'!B198+'Calculs fonctionnement'!C218*'Calculs fonctionnement'!D211*'Calculs fonctionnement'!D212","v":{"v":0,"d":"0.00"}},{"$f":"'Calculs fonctionnement'!B86","v":{"v":0,"d":"0.00"}},{"$f":"'Calculs fonctionnement'!C218*'Calculs fonctionnement'!K211*'Calculs fonctionnement'!K212","v":{"v":0,"d":"0.00"}},{"$f":"'Calculs fonctionnement'!B108","v":{"v":0,"d":"0.00"}},{"$f":"'Calculs fonctionnement'!B127+'Calculs fonctionnement'!C218*'Calculs fonctionnement'!G211*'Calculs fonctionnement'!G212","v":{"v":0,"d":"0.00"}},{"$f":"'Calculs fonctionnement'!C218*'Calculs fonctionnement'!H211*'Calculs fonctionnement'!H212","v":{"v":0,"d":"0.00"}},{"$f":"'Calculs fonctionnement'!B145+'Calculs fonctionnement'!C218*'Calculs fonctionnement'!I211*'Calculs fonctionnement'!I212","v":{"v":0,"d":"0.00"}},{"$f":"'Calculs fonctionnement'!B153","v":{"v":0,"d":"0.00"}},{"$f":"'Calculs fonctionnement'!B166+'Calculs fonctionnement'!C218*'Calculs fonctionnement'!J211*'Calculs fonctionnement'!J212","v":{"v":0,"d":"0.00"}},{"$f":"'Calculs fonctionnement'!B191+'Calculs fonctionnement'!B179","v":{"v":0,"d":"0.00"}},{"$f":"'Calculs fonctionnement'!C218*'Calculs fonctionnement'!E211*'Calculs fonctionnement'!E212","v":{"v":0,"d":"0.00"}},{"$f":"'Calculs fonctionnement'!C218*'Calculs fonctionnement'!F211*'Calculs fonctionnement'!F212","v":{"v":0,"d":"0.00"}},{"$f":"'Calculs fonctionnement'!L19","v":{"v":0,"d":"0.00"}},{"$f":"'Calculs fonctionnement'!M19","v":{"v":0,"d":"0.00"}},{"$f":"'Calculs fonctionnement'!N19","v":{"v":0,"d":"0.00"}},{"$f":"'Calculs fonctionnement'!P19+'Calculs fonctionnement'!U21","v":{"v":0,"d":"0.00"}},{"$f":"'Calculs fonctionnement'!Q19+'Calculs fonctionnement'!V21","v":{"v":0,"d":"0.00"}},{"$f":"'Calculs fonctionnement'!R19+'Calculs fonctionnement'!W21","v":{"v":0,"d":"0.00"}},{"$f":"'Calculs fonctionnement'!B65","v":{"$error":"#VALUE!"}}]
[null,"t eq CO2 20 ans",{"$f":"'Données projet substrat'!BW4","v":{"v":0,"d":"0.00"}},null,"GES évités","kg eq CO2 20 ans",{"$nulls":33},{"$f":"-'Calculs fonctionnement'!B245","v":{"v":0,"d":"0.00"}},{"$f":"-'Calculs fonctionnement'!B264-'Calculs fonctionnement'!B268-'Calculs fonctionnement'!B272","v":{"v":0,"d":"0.00"}},{"$f":"-'Calculs fonctionnement'!B249","v":{"v":0,"d":"0.00"}},{"$f":"-'Calculs fonctionnement'!B253","v":{"v":0,"d":"0.00"}},{"$f":"-'Calculs fonctionnement'!B303","v":{"v":0,"d":"0.00"}},{"$f":"-'Calculs fonctionnement'!B258","v":{"v":0,"d":"0.00"}}]
[null,"t C 100 ans",{"$f":"'Données projet substrat'!BY4","v":{"v":0,"d":"0.00"}},null,"GES émis","kg eq CO2 100 ans",{"$f":"'Calculs fonctionnement'!B28+'Calculs fonctionnement'!B35+'Calculs fonctionnement'!B180","v":{"v":0,"d":"0.00"}},{"$f":"'Calculs fonctionnement'!B42","v":{"v":0,"d":"0.00"}},{"$f":"'Calculs fonctionnement'!B49","v":{"v":0,"d":"0.00"}},{"$f":"'Calculs fonctionnement'!B55","v":{"v":0,"d":"0.00"}},{"$f":"'Calculs fonctionnement'!D28+'Calculs fonctionnement'!C35+'Calculs fonctionnement'!F180","v":{"v":0,"d":"0.00"}},{"$f":"'Calculs fonctionnement'!C42","v":{"v":0,"d":"0.00"}},{"$f":"'Calculs fonctionnement'!C49","v":{"v":0,"d":"0.00"}},{"$f":"'Calculs fonctionnement'!C55","v":{"v":0,"d":"0.00"}},{"$f":"SUMIF('Données projet substrat'!F6:F14,\"Fumier\",'Données projet substrat'!CI6:CI14)","v":{"v":0,"d":"0.00"}},{"$f":"SUMIF('Données projet substrat'!F6:F14,\"Lisier\",'Données projet substrat'!CI6:CI14)","v":{"v":0,"d":"0.00"}},{"$f":"'Calculs fonctionnement'!B61","v":{"v":0,"d":"0.00"}},{"$f":"'Calculs fonctionnement'!C218*'Calculs fonctionnement'!B213","v":{"v":0,"d":"0.00"}},{"$f":"'Calculs fonctionnement'!C219*'Calculs fonctionnement'!L211*'Calculs fonctionnement'!L213","v":{"v":0,"d":"0.00"}},{"$f":"IF('Calculs fonctionnement'!B218=1,'Calculs fonctionnement'!B239,'Calculs fonctionnement'!C213*'Calculs fonctionnement'!C211+'Calculs fonctionnement'!C219*'Calculs fonctionnement'!M213)+'Calculs fonctionnement'!F87","v":{"v":0,"d":"0.00"}},{"$f":"'Calculs fonctionnement'!B96+'Calculs fonctionnement'!B199+'Calculs fonctionnement'!C218*'Calculs fonctionnement'!D211*'Calculs fonctionnement'!D213","v":{"v":0,"d":"0.00"}},{"$f":"'Calculs fonctionnement'!B87","v":{"v":0,"d":"0.00"}},{"$f":"'Calculs fonctionnement'!C218*'Calculs fonctionnement'!K211*'Calculs fonctionnement'!K213","v":{"v":0,"d":"0.00"}},{"$f":"'Calculs fonctionnement'!B109","v":{"v":0,"d":"0.00"}},{"$f":"'Calculs fonctionnement'!B128+'Calculs fonctionnement'!C218*'Calculs fonctionnement'!G211*'Calculs fonctionnement'!G213","v":{"v":0,"d":"0.00"}},{"$f":"'Calculs fonctionnement'!C218*'Calculs fonctionnement'!H211*'Calculs fonctionnement'!H213","v":{"v":0,"d":"0.00"}},{"$f":"'Calculs fonctionnement'!B146+'Calculs fonctionnement'!C218*'Calculs fonctionnement'!I211*'Calculs fonctionnement'!I213","v":{"v":0,"d":"0.00"}},{"$f":"'Calculs fonctionnement'!B154","v":{"v":0,"d":"0.00"}},{"$f":"'Calculs fonctionnement'!B167+'Calculs fonctionnement'!C218*'Calculs fonctionnement'!J211*'Calculs fonctionnement'!J213","v":{"v":0,"d":"0.00"}},{"$f":"'Calculs fonctionnement'!B192+'Calculs fonctionnement'!B180","v":{"v":0,"d":"0.00"}},{"$f":"'Calculs fonctionnement'!C218*'Calculs fonctionnement'!E211*'Calculs fonctionnement'!E213","v":{"v":0,"d":"0.00"}},{"$f":"'Calculs fonctionnement'!C218*'Calculs fonctionnement'!F211*'Calculs fonctionnement'!F213","v":{"v":0,"d":"0.00"}},{"$f":"'Calculs fonctionnement'!L20","v":{"v":0,"d":"0.00"}},{"$f":"'Calculs fonctionnement'!M20","v":{"v":0,"d":"0.00"}},{"$f":"'Calculs fonctionnement'!N20","v":{"v":0,"d":"0.00"}},{"$f":"'Calculs fonctionnement'!P20+'Calculs fonctionnement'!U22","v":{"v":0,"d":"0.00"}},{"$f":"'Calculs fonctionnement'!Q20+'Calculs fonctionnement'!V22","v":{"v":0,"d":"0.00"}},{"$f":"'Calculs fonctionnement'!R20+'Calculs fonctionnement'!W22","v":{"v":0,"d":"0.00"}},{"$f":"'Calculs fonctionnement'!B66","v":{"$error":"#VALUE!"}}]
[null,"t eq CO2 100 ans",{"$f":"'Données projet substrat'!BZ4","v":{"v":0,"d":"0.00"}},null,"GES évités","kg eq CO2 100 ans",{"$nulls":33},{"$f":"-'Calculs fonctionnement'!B246","v":{"v":0,"d":"0.00"}},{"$f":"-'Calculs fonctionnement'!B265-'Calculs fonctionnement'!B269-'Calculs fonctionnement'!B273","v":{"v":0,"d":"0.00"}},{"$f":"-'Calculs fonctionnement'!B250","v":{"v":0,"d":"0.00"}},{"$f":"-'Calculs fonctionnement'!B254","v":{"v":0,"d":"0.00"}},{"$f":"-'Calculs fonctionnement'!B304","v":{"v":0,"d":"0.00"}},{"$f":"-'Calculs fonctionnement'!B259","v":{"v":0,"d":"0.00"}}]
[{"$nulls":4},"Enérgie consommée","Ressources fossiles et nucléaires (kWh eq)",{"$f":"'Calculs fonctionnement'!B36","v":{"v":0,"d":"0.00"}},{"$f":"'Calculs fonctionnement'!B43","v":{"v":0,"d":"0.00"}},{"$f":"'Calculs fonctionnement'!B51","v":{"v":0,"d":"0.00"}},{"$f":"'Calculs fonctionnement'!B56","v":{"v":0,"d":"0.00"}},{"$f":"'Calculs fonctionnement'!C36","v":{"v":0,"d":"0.00"}},{"$f":"'Calculs fonctionnement'!C43","v":{"v":0,"d":"0.00"}},{"$f":"'Calculs fonctionnement'!C51","v":{"v":0,"d":"0.00"}},{"$f":"'Calculs fonctionnement'!C56","v":{"v":0,"d":"0.00"}},null,null,{"$f":"'Calculs fonctionnement'!B62","v":{"v":0,"d":"0.00"}},{"$f":"'Calculs fonctionnement'!C218*'Calculs fonctionnement'!B214","v":{"v":0,"d":"0.00"}},{"$f":"'Calculs fonctionnement'!C219*'Calculs fonctionnement'!L211*'Calculs fonctionnement'!L214","v":{"v":0,"d":"0.00"}},{"$f":"IF('Calculs fonctionnement'!B218=1,'Calculs fonctionnement'!B240,'Calculs fonctionnement'!C214*'Calculs fonctionnement'!C211+'Calculs fonctionnement'!C219*'Calculs fonctionnement'!M214)","v":{"v":0,"d":"0.00"}},{"$f":"'Calculs fonctionnement'!B200+'Calculs fonctionnement'!C218*'Calculs fonctionnement'!D211*'Calculs fonctionnement'!D214","v":{"v":0,"d":"0.00"}},null,{"$f":"'Calculs fonctionnement'!C218*'Calculs fonctionnement'!K211*'Calculs fonctionnement'!K214","v":{"v":0,"d":"0.00"}},null,{"$f":"'Calculs fonctionnement'!B129+'Calculs fonctionnement'!C218*'Calculs fonctionnement'!G211*'Calculs fonctionnement'!G214","v":{"v":0,"d":"0.00"}},{"$f":"'Calculs fonctionnement'!C218*'Calculs fonctionnement'!H211*'Calculs fonctionnement'!H214","v":{"v":0,"d":"0.00"}},{"$f":"'Calculs fonctionnement'!B147+'Calculs fonctionnement'!C218*'Calculs fonctionnement'!I211*'Calculs fonctionnement'!I214","v":{"v":0,"d":"0.00"}},{"$f":"'Calculs fonctionnement'!B155","v":{"v":0,"d":"0.00"}},{"$f":"'Calculs fonctionnement'!C218*'Calculs fonctionnement'!J211*'Calculs fonctionnement'!J214","v":{"v":0,"d":"0.00"}},null,{"$f":"'Calculs fonctionnement'!C218*'Calculs fonctionnement'!E211*'Calculs fonctionnement'!E214","v":{"v":0,"d":"0.00"}},{"$f":"'Calculs fonctionnement'!C218*'Calculs fonctionnement'!F211*'Calculs fonctionnement'!F214","v":{"v":0,"d":"0.00"}},{"$nulls":3},{"$f":"'Calculs fonctionnement'!P21","v":{"v":0,"d":"0.00"}},{"$f":"'Calculs fonctionnement'!Q21","v":{"v":0,"d":"0.00"}},{"$f":"'Calculs fonctionnement'!R21","v":{"v":0,"d":"0.00"}},{"$f":"'Calculs fonctionnement'!B68","v":{"$error":"#VALUE!"}}]
[{"$nulls":4},"Enérgie évitée","Ressources fossiles et nucléaires (kWh eq)",{"$nulls":33},{"$f":"-'Calculs fonctionnement'!B247","v":{"v":0,"d":"0.00"}},{"$f":"-'Calculs fonctionnement'!B266-'Calculs fonctionnement'!B270-'Calculs fonctionnement'!B274","v":{"v":0,"d":"0.00"}},{"$f":"-'Calculs fonctionnement'!B251","v":{"v":0,"d":"0.00"}},{"$f":"-'Calculs fonctionnement'!B255","v":{"v":0,"d":"0.00"}},{"$f":"-'Calculs fonctionnement'!B305","v":{"v":0,"d":"0.00"}},{"$f":"-'Calculs fonctionnement'!B260","v":{"v":0,"d":"0.00"}}]
[]
[null,"2) Première agrégation (Résultats détaillés)"]
[null,"Stockage de carbone par les CIVE",{"$nulls":9},"Toutes les consommations électriques si c'est déclaré"]
[{"$nulls":6},"Production de substrats cultivés (cultures dédiées)","Production de substrats cultivés (CIVE)","Stockage des effluents d'élevage","Transport des substrats","Prétraitement","Méthaniseur","Méthaniseur (estimation des émissions fugitives structurelles)","Valorisation du biogaz en cogénération","Valorisation du biogaz en injection (biométhane et BioGNV)","Valorisation du digestat (séparation, stockage et épandage)","Valorisation du digestat (transport)","Evitées par la substitution de diesel de la culture CIPAN par les CIVE","Evitées par la substitution d'énergie","Evitées par la substitution de traitement de déchets et d'effluents","Evitées par la substitution de transport de déchets","Evitées par la substitution d'engrais","Evitées par la production de CO2 biogénique (évitement du transport de CO2 fossile)"]
[null,"t C 20 ans",{"$f":"C25","v":{"v":0,"d":"0.00"}},null,"GES émis","kg eq CO2 20 ans",{"$f":"SUM(G25:J25)","v":{"v":0,"d":"0.00"}},{"$f":"SUM(K24:N24)","v":{"v":0,"d":"0.00"}},{"$f":"SUM(O25:P25)","v":{"v":0,"d":"0.00"}},{"$f":"Q25","v":{"v":0,"d":"0.00"}},{"$f":"SUM(R25:S25)","v":{"v":0,"d":"0.00"}},{"$f":"SUM(T25:U25)","v":{"v":0,"d":"0.00"}},{"$f":"V25","v":{"v":0,"d":"0.00"}},{"$f":"SUM(W25:X25)","v":{"v":0,"d":"0.00"}},{"$f":"SUM(Y25:AD25)","v":{"v":0,"d":"0.00"}},{"$f":"SUM(AE25:AL25)","v":{"v":0,"d":"0.00"}},{"$f":"AM25","v":{"$error":"#VALUE!"}}]
[null,"t eq CO2 20 ans",{"$f":"C26","v":{"v":0,"d":"0.00"}},null,"GES évités","kg eq CO2 20 ans",{"$nulls":11},{"$f":"AN26","v":{"v":0,"d":"0.00"}},{"$f":"AO26","v":{"v":0,"d":"0.00"}},{"$f":"AP26","v":{"v":0,"d":"0.00"}},{"v":0,"d":"0.00"},{"v":0,"d":"0.00"},{"v":0,"d":"0.00"}]
[null,"t C 100 ans",{"$f":"C27","v":{"v":0,"d":"0.00"}},null,"GES émis","kg eq CO2 100 ans",{"$f":"SUM(G27:J27)","v":{"v":0,"d":"0.00"}},{"$f":"SUM(K27:N27)","v":{"v":0,"d":"0.00"}},{"$f":"SUM(O27:P27)","v":{"v":0,"d":"0.00"}},{"$f":"Q27","v":{"v":0,"d":"0.00"}},{"$f":"SUM(R27:S27)","v":{"v":0,"d":"0.00"}},{"$f":"SUM(T27:U27)","v":{"v":0,"d":"0.00"}},{"$f":"V27","v":{"v":0,"d":"0.00"}},{"$f":"SUM(W27:X27)","v":{"v":0,"d":"0.00"}},{"$f":"SUM(Y27:AD27)","v":{"v":0,"d":"0.00"}},{"$f":"SUM(AE27:AL27)","v":{"v":0,"d":"0.00"}},{"$f":"AM27","v":{"$error":"#VALUE!"}}]
[null,"t eq CO2 100 ans",{"$f":"C28","v":{"v":0,"d":"0.00"}},null,"GES évités","kg eq CO2 100 ans",{"$nulls":11},{"$f":"AN28","v":{"v":0,"d":"0.00"}},{"v":0,"d":"0.00"},{"v":0,"d":"0.00"},{"v":0,"d":"0.00"},{"v":0,"d":"0.00"},{"v":0,"d":"0.00"}]
[{"$nulls":4},"Enérgie consommée","Ressources fossiles et nucléaires (kWh eq)",{"$f":"SUM(G29:J29)","v":{"v":0,"d":"0.00"}},{"$f":"SUM(K29:N29)","v":{"v":0,"d":"0.00"}},{"$f":"SUM(O29:P29)","v":{"v":0,"d":"0.00"}},{"$f":"Q29","v":{"v":0,"d":"0.00"}},{"$f":"SUM(R29:S29)","v":{"v":0,"d":"0.00"}},{"$f":"SUM(T29:U29)","v":{"v":0,"d":"0.00"}},{"$f":"V29","v":{"v":0,"d":"0.00"}},{"$f":"SUM(W29:X29)","v":{"v":0,"d":"0.00"}},{"$f":"SUM(Y29:AD29)","v":{"v":0,"d":"0.00"}},{"$f":"SUM(AE29:AL29)","v":{"v":0,"d":"0.00"}},{"$f":"AM29","v":{"$error":"#VALUE!"}}]
[{"$nulls":4},"Enérgie évitée","Ressources fossiles et nucléaires (kWh eq)",{"$nulls":11},{"$f":"AN30","v":{"v":0,"d":"0.00"}},{"$f":"AO30","v":{"v":0,"d":"0.00"}},{"$f":"AP30","v":{"v":0,"d":"0.00"}},{"v":0,"d":"0.00"},{"v":0,"d":"0.00"},{"v":0,"d":"0.00"}]
[]
[null,"3) Résultats agrégés (tableau de bord)"]
[null,"Stockage de carbone par les CIVE"]
[{"$nulls":6},"Emissions générées","Emissions évitées"]
[null,"t C 20 ans",{"$f":"C35","v":{"v":0,"d":"0.00"}},null,"GES émis","t eq CO2 20 ans",{"$f":"SUM(G35:Q35)/1000","v":{"$error":"#VALUE!"}}]
[null,"t eq CO2 20 ans",{"$f":"C36","v":{"v":0,"d":"0.00"}},null,"GES évités","t eq CO2 20 ans",null,{"$f":"SUM(R36:W36)/1000","v":0}]
[null,"t C 100 ans",{"$f":"C37","v":{"v":0,"d":"0.00"}},null,"GES émis","t eq CO2 100 ans",{"$f":"SUM(G37:Q37)/1000","v":{"$error":"#VALUE!"}}]
[null,"t eq CO2 100 ans",{"$f":"C38","v":{"v":0,"d":"0.00"}},null,"GES évités","t eq CO2 100 ans",null,{"$f":"SUM(R38:W38)/1000","v":0}]
[{"$nulls":4},"Enérgie consommée","Ressources fossiles et nucléaires (MWh eq)",{"$f":"SUM(G39:Q39)/1000","v":{"$error":"#VALUE!"}}]
[{"$nulls":4},"Enérgie évitée","Ressources fossiles et nucléaires (MWh eq)",null,{"$f":"SUM(R40:W40)/1000","v":0}]
[]
[{"$nulls":4},"Score net aggrégé GES émis à 20 ans (t)",{"$f":"IFERROR(G45+H46,0)","v":{"v":0,"d":"0.00"}},null,{"$f":"IF(F52>0,IF(F52<G45*20%,\"orange\",\"rouge\"),IF(ABS(F52)<G45*20%,\"orange\",\"vert\"))","v":{"$error":"#VALUE!"}}]
[{"$nulls":4},"Score net aggrégé GES émis à 100 ans (t)",{"$f":"IFERROR(G47+H48,0)","v":{"v":0,"d":"0.00"}},null,{"$f":"IF(F53>0,IF(F53<G47*20%,\"orange\",\"rouge\"),IF(ABS(F53)<G47*20%,\"orange\",\"vert\"))","v":{"$error":"#VALUE!"}}]
[{"$nulls":4},"Score net aggrégé ressources fossiles et nucléaires (MWh)",{"$f":"IFERROR(G49+H50,0)","v":{"v":0,"d":"0.00"}}]
[{"$nulls":5},"rouge si positif / vert si négatif"]
[]
[null,"Graphique de résultats"]
[null,"20 ans tonnes)","Production de substrats cultivés (cultures dédiées)","Production de substrats cultivés (CIVE)","Stockage des effluents d'élevage","Transport des substrats","Prétraitement","Méthaniseur","Méthaniseur (estimation des émissions fugitives structurelles)","Valorisation du biogaz en cogénération","Valorisation du biogaz en injection (biométhane et BioGNV)","Valorisation du digestat (séparation, stockage et épandage)","Valorisation du digestat (transport)","Evitées par la substitution de diesel de la culture CIPAN par les CIVE","Evitées par la substitution d'énergie","Evitées par la substitution de traitement de déchets et d'effluents","Evitées par la substitution de transport de déchets","Evitées par la substitution d'engrais","Evitées par la production de CO2 biogénique (évitement du transport de CO2 fossile)"]
[null,"Emissions GES générés",{"$f":"G35/1000","v":{"v":0,"d":"0.00"}},{"v":0,"d":"0.00"},{"v":0,"d":"0.00"},{"v":0,"d":"0.00"},{"v":0,"d":"0.00"},{"v":0,"d":"0.00"},{"$f":"M35/1000","v":{"v":0,"d":"0.00"}},{"v":0,"d":"0.00"},{"v":0,"d":"0.00"},{"v":0,"d":"0.00"},{"$error":"#VALUE!"}]
[null,"Emissions GES évités",{"$nulls":11},{"$f":"R36/1000","v":{"v":0,"d":"0.00"}},{"v":0,"d":"0.00"},{"v":0,"d":"0.00"},{"v":0,"d":"0.00"},{"v":0,"d":"0.00"},{"v":0,"d":"0.00"}]
[null,"100 ans (onnes)","Production de substrats cultivés (cultures dédiées)","Production de substrats cultivés (CIVE)","Stockage des effluents d'élevage","Transport des substrats","Prétraitement","Méthaniseur","Méthaniseur (estimation des émissions fugitives structurelles)","Valorisation du biogaz en cogénération","Valorisation du biogaz en injection (biométhane et BioGNV)","Valorisation du digestat (séparation, stockage et épandage)","Valorisation du digestat (transport)","Evitées par la substitution de diesel de la culture CIPAN par les CIVE","Evitées par la substitution d'énergie","Evitées par la substitution de traitement de déchets et d'effluents","Evitées par la substitution de transport de déchets","Evitées par la substitution d'engrais","Evitées par la production de CO2 biogénique (évitement du transport de CO2 fossile)"]
[null,"Emissions GES générés",{"$f":"G37/1000","v":{"v":0,"d":"0.00"}},{"$f":"H37/1000","v":{"v":0,"d":"0.00"}},{"v":0,"d":"0.00"},{"v":0,"d":"0.00"},{"v":0,"d":"0.00"},{"v":0,"d":"0.00"},{"v":0,"d":"0.00"},{"v":0,"d":"0.00"},{"v":0,"d":"0.00"},{"v":0,"d":"0.00"},{"$error":"#VALUE!"}]
[null,"Emissions GES évités",{"$nulls":11},{"$f":"R38/1000","v":{"v":0,"d":"0.00"}},{"v":0,"d":"0.00"},{"v":0,"d":"0.00"},{"v":0,"d":"0.00"},{"v":0,"d":"0.00"},{"v":0,"d":"0.00"}]
[null,"énergie (kWh)","Production de substrats cultivés (cultures dédiées)","Production de substrats cultivés (CIVE)","Stockage des effluents d'élevage","Transport des substrats","Prétraitement","Méthaniseur","Méthaniseur (estimation des émissions fugitives structurelles)","Valorisation du biogaz en cogénération","Valorisation du biogaz en injection (biométhane et BioGNV)","Valorisation du digestat (séparation, stockage et épandage)","Valorisation du digestat (transport)","Evitées par la substitution de diesel de la culture CIPAN par les CIVE","Evitées par la substitution d'énergie","Evitées par la substitution de traitement de déchets et d'effluents","Evitées par la substitution de transport de déchets","Evitées par la substitution d'engrais","Evitées par la production de CO2 biogénique (évitement du transport de CO2 fossile)","seuil critique"]
[null,"Energie fossile et nucléaire consommée",{"$f":"G39","v":{"v":0,"d":"0.00"}},{"$f":"H39","v":{"v":0,"d":"0.00"}},{"v":0,"d":"0.00"},{"v":0,"d":"0.00"},{"v":0,"d":"0.00"},{"v":0,"d":"0.00"},{"v":0,"d":"0.00"},{"v":0,"d":"0.00"},{"v":0,"d":"0.00"},{"v":0,"d":"0.00"},{"$error":"#VALUE!"},{"$nulls":6},{"$f":"-SUM(N66:S66)","v":{"v":0,"d":"0.00"}}]
[null,"Energie fossile et nucléaire évitée",{"$nulls":11},{"$f":"R40","v":{"v":0,"d":"0.00"}},{"v":0,"d":"0.00"},{"v":0,"d":"0.00"},{"v":0,"d":"0.00"},{"v":0,"d":"0.00"},{"v":0,"d":"0.00"},{"$f":"-SUM(N66:S66)","v":{"v":0,"d":"0.00"}}]
[]
[null,"Résultats énergétiques"]
[null,"TRE",{"$f":"'Calculs fonctionnement'!B334","v":{"$error":"#DIV/0!"}}]
[null,"V",{"$f":"'Calculs fonctionnement'!B330","v":{"$error":"#DIV/0!"}}]

{"sheet":"Résultats tableau de bord","index":17,"n_rows":38,"n_cols":23,"rows_kept":38,"merged":[[2,2,2,23],[7,3,7,10],[11,19,13,23],[29,14,29,16],[29,20,29,22],[30,3,30,8],[30,19,30,23],[31,19,31,23],[32,13,32,17],[32,19,32,23],[33,3,34,10],[34,13,35,17]]}
[]
[null,{"$f":"'Données projet'!B6","v":0}]
[null,{"$f":"TODAY()","v":"2024-01-29"},"Diagnostic DIGES 3 - Tableau de bord des résultats"]
[null,{"$f":"'Données projet'!B7","v":0}]
[]
[]
[]
[{"$nulls":3},"Résultats sur l'indicateur de changement climatique à horizon 100 ans",{"$nulls":10},"Résultats techniques",{"$nulls":5},"Résultats énergétiques"]
[{"$nulls":13},"   •  Type d'installation :",null,null,{"$f":"'Données projet'!B8","v":"Votre choix"},null,null,"   •  Taux de retour énergétique :",null,null,{"$f":"'Calculs d''impacts'!C69","v":{"$error":"#DIV/0!"}}]
[{"$nulls":13},"   •  Type de valorisation du biogaz :",null,null,{"$f":"'Données projet'!B9","v":"Votre choix"}]
[{"$nulls":13},"   •  Type de voie de digestion :",null,null,{"$f":"'Description des substrats'!E6","v":"Humide"},null,null,"L’unité produit  ",null,{"$f":"W9","v":{"$error":"#DIV/0!"}}]
[{"$nulls":8},"BILAN NET :",{"$f":"'Calculs d''impacts'!F53","v":{"v":0,"d":"0.00"}},"tonnes équivalent CO2",null,null,"   •  Type de torchère :",null,null,{"$f":"IF('Données projet'!B76=\"Oui\",\"automatique\",\"manuelle\")","v":"manuelle"},null,null,"fois plus d’énergie qu’elle n’en dépense. Un taux proche de 1 correspond à un gain énergétique nul. Plus le taux est élevé, meilleur est le ratio entre la production d'énergie au regard de la consommation par l'unité."]
[{"$nulls":13},"   •  Tonnage annuel de matière brute :",null,null,{"$f":"'Calculs fonctionnement'!B5","v":0},"t"]
[{"$nulls":14},"Production de biométhane"]
[{"$nulls":8},"Feu tricolore :",{"$nulls":4},"   •  Capacité moyenne annuelle :",null,null,{"$f":"'Données projet'!B10","v":0},"Nm3.h"]
[{"$nulls":8},{"$f":"'Calculs d''impacts'!$H$53","v":{"$error":"#VALUE!"}},{"$nulls":4},"   •  Capacité annuel de production :",null,null,{"$f":"'Données projet'!B11","v":0},"GWh/an",null,"   •  Energie valorisée :",null,{"$f":"'Calculs d''impacts'!C70","v":{"$error":"#DIV/0!"}}]
[{"$nulls":14},"Cogénération ou chaleur seule",{"$nulls":4},"(% d'énergie primaire convertie en énergie finale)"]
[{"$nulls":13},"   •  Puissance électrique installée :",null,null,{"$f":"'Données projet'!B12","v":0},"kW élec."]
[{"$nulls":8},"Feu rouge : situation défavorable",{"$nulls":4},"   •  Puissance thermique installée :",null,null,{"$f":"'Données projet'!B13","v":0},"kW th."]
[{"$nulls":8},"Feu orange : zone d'incertitude"]
[{"$nulls":8},"Feu vert : situation favorable",{"$nulls":4},{"$f":"IF($I$16=\"rouge\",\"l\",\"\")","v":{"$error":"#VALUE!"}},{"$f":"IF($I$16=\"orange\",\"l\",\"\")","v":{"$error":"#VALUE!"}},{"$f":"IF($I$16=\"vert\",\"l\",\"\")","v":{"$error":"#VALUE!"}}]
{"$rows_empty":8}
[{"$nulls":14},"Résultats de flux d'azote",{"$nulls":5},"Attention"]
[{"$nulls":3},"•  Taux d'émissions fugitives calculé pour l'installation (en pourcentage de la production annuelle de méthane contenu dans le biogaz) :",{"$nulls":5},{"$f":"'Calculs fonctionnement'!B71","v":{"v":0.05,"d":"5.00%"}},{"$nulls":9},"Le stockage du carbone dans le sol n'a pas été calculé: donnée(s) manquante(s) pour 1 ou plusieurs substrats"]
[{"$nulls":3},"•  Emissions fugitives hypothétiques : δ100ans =",{"$nulls":3},{"$f":"'Calcul delta'!B71*'Calcul delta'!C80","v":{"v":0,"d":"0.00"}},"kg de méthane sur un an."]
[{"$nulls":3},"soit",{"$f":"'Calcul delta'!B71*100","v":{"v":11.569354653964982,"d":"11.57"}},"% de la production annuelle de méthane contenu dans le biogaz",{"$nulls":7},"   •  Evitement de fertilisants de synthèse (hors digestat épandu sur les CIVE et les cultures principales) :",{"$nulls":5},"Des informations de l'onglet Economie circulaire et Enjeux biodiversité n'ont pas été saisies."]
[{"$nulls":3},"Le δ correspond au seuil d’émissions fugitives potentielles au-delà duquel on observe une inversion des bénéfices de l’unité sur le changement climatique (plus l’indicateur est élevé plus le risque d’inversion des bénéfices est faible)",{"$nulls":9},{"$f":"'Résultats détaillés'!W161","v":{"v":0,"d":"0.00"}},"kg UN/an"]
[{"$nulls":13},"   •  Equivalence en surface de SAU ferilisée (pour une dose de 170 UN/ha, hors CIVE et cultures principales) :"]
[{"$nulls":3},"•  Estimation par AMG d’un stockage de carbone de :",{"$nulls":3},{"$f":"'Calculs d''impacts'!C47","v":{"v":0,"d":"0.00"}},"tonnes de carbone par an au sein de "]
[{"$nulls":3},"la matière organique du sol. Soit un équivalent CO2 de ",{"$nulls":4},{"$f":"'Calculs d''impacts'!C48","v":{"v":0,"d":"0.00"}},"t CO2 eq / an",{"$nulls":3},{"$f":"'Résultats détaillés'!W163","v":{"v":0,"d":"0.00"}},"ha de SAU / an"]
[{"$nulls":3},"sous l’hypothèse du maintien des pratiques de culture des CIVE et de la teneur en carbone stable."]

{"sheet":"Résultats détaillés","index":18,"n_rows":195,"n_cols":24,"rows_kept":195,"merged":[[2,2,2,23],[5,2,5,22],[8,11,9,12],[8,13,9,16],[8,17,9,18],[8,19,9,20],[10,11,10,12],[10,13,10,16],[10,17,10,18],[10,19,10,20],[11,11,11,12],[11,13,11,16],[11,17,11,18],[11,19,11,20],[12,11,12,12],[12,13,12,16],[12,17,12,18],[12,19,12,20],[13,11,13,12],[13,13,13,16],[13,17,13,18],[13,19,13,20],[14,11,14,12],[14,13,14,16],[14,17,14,18],[14,19,14,20],[15,11,15,16],[15,17,15,18],[15,19,15,20],[27,2,27,13],[30,19,33,23],[45,15,46,21],[49,15,49,23],[51,19,51,23],[68,2,68,13],[71,19,74,23],[109,2,109,23],[140,2,140,12],[140,14,140,23],[158,15,159,22],[161,15,162,21],[166,2,166,23],[168,4,168,19],[169,4,169,11],[169,12,169,18],[170,4,170,11],[170,12,170,18],[171,4,171,11],[171,12,171,18],[172,4,172,11],[172,12,172,18],[173,4,173,19],[174,4,174,11],[174,12,174,19],[175,4,175,11],[175,12,175,19],[176,4,176,11],[176,12,176,19],[177,4,177,11],[177,12,177,19],[178,4,178,11],[178,12,178,19],[179,4,179,19],[180,4,180,11],[180,12,180,18],[181,4,181,11],[181,12,181,19],[182,4,182,11],[182,12,182,19],[183,4,183,11],[183,12,183,19],[184,4,184,19],[185,4,185,11],[185,12,185,19],[186,4,186,11],[186,12,186,19],[187,4,187,11],[187,12,187,19],[188,4,188,11],[188,12,188,19],[189,4,189,19],[190,4,190,11],[190,12,190,19],[191,4,191,11],[191,12,191,19],[192,4,192,11],[192,12,192,18],[193,4,193,11],[193,12,193,19],[194,4,194,11],[194,12,194,18]]}
[]
[null,{"$f":"'Données projet'!B6","v":0}]
[null,{"$f":"TODAY()","v":"2024-01-29"},"Diagnostic DIGES 3 - Résultats détaillés"]
[null,{"$f":"'Données projet'!B7","v":0}]
[]
[null,null,"Résultats techniques"]
[]
[{"$nulls":3},"   •  Type d'installation :",{"$nulls":4},{"$f":"'Données projet'!B8","v":"Votre choix"},null,null,"   •  Liste des principaux substrats :"]
[{"$nulls":3},"   •  Type de valorisation du biogaz :",{"$nulls":4},{"$f":"'Données projet'!B9","v":"Votre choix"},null,null,"Numéro du substrat",null,"Nom du substrat",{"$nulls":3},"% en MB du mélange",null,"% de production de l'énergie primaire"]
[{"$nulls":3},"   •  Type de voie de digestion :",{"$nulls":4},{"$f":"'Description des substrats'!E6","v":"Humide"}]
[{"$nulls":3},"   •  TSH estimé pour votre installation",{"$nulls":4},{"$f":"'Données projet'!B23","v":{"$error":"#DIV/0!"}},"jours",null,"Substrat 2",null,"Bovin - Lisiers autres",{"$nulls":3},{"v":0.5088877602844083,"d":"50.9%"},null,{"v":0.18469611224073287,"d":"18.5%"}]
[{"$nulls":3},"   •  Type de torchère :",{"$nulls":4},{"$f":"IF('Données projet'!B76=\"Oui\",\"Automatique\",\"Manuelle\")","v":"Manuelle"},null,null,"Substrat 9",null,"Féculerie/ transformation de pomme de terre",{"$nulls":3},{"v":0.10986964618249534,"d":"11.0%"},null,{"v":0.16640621814545023,"d":"16.6%"}]
[{"$nulls":3},"   •  Distance moyenne de transport des substrats :",{"$nulls":4},{"$f":"'Données projet substrat'!H4","v":{"$error":"#DIV/0!"}},"km",null,"Substrat 8",null,"Soupe de déconditionnement",{"$nulls":3},{"v":0.09480277636702218,"d":"9.5%"},null,{"v":0.12996855729122359,"d":"13.0%"}]
[{"$nulls":3},"   •  Distance maximale de transport des substrats :",{"$nulls":4},{"$f":"MAX('Données projet substrat'!H6:H2086)","v":0},"km",null,"Substrat 1",null,"Volaille -  Fumier (autres), fientes",{"$nulls":3},{"v":0.07651938378195361,"d":"7.7%"},null,{"v":0.13126699400599287,"d":"13.1%"}]
[{"$nulls":3},"   •  Distance moyenne de transport du digestat :",{"$nulls":4},{"$f":"'Données projet'!B92","v":""},"km",null,"Substrat 4",null,"Céréales immatures, ensilées, non ensilées",{"$nulls":3},{"v":0.07008633824276282,"d":"7.0%"},null,{"v":0.11233762184901899,"d":"11.2%"}]
[{"$nulls":3},"   •  Tonnage annuel de matière brute :",{"$nulls":4},{"$f":"'Données projet substrat'!G4","v":0},"tonnes",null,"TOTAL",{"$nulls":5},{"$f":"SUM(R11:S15)","v":{"v":0.8601659048586423,"d":"86.0%"}},null,{"$f":"SUM(T11:U15)","v":{"v":0.7246755035324185,"d":"72.5%"}}]
[{"$nulls":3},"   •  Capacité moyenne annuelle de production de biométhane :",{"$nulls":4},{"$f":"'Données projet'!B10","v":0},"Nm3.h"]
[{"$nulls":3},"   •  Capacité annuelle de production de biométhane :",{"$nulls":4},{"$f":"'Données projet'!B11","v":0},"GWh / an"]
[{"$nulls":3},"   •  Puissance électrique installée (kWe, si cogénération)",{"$nulls":4},{"$f":"'Données projet'!B12","v":0},"kW électriques"]
[{"$nulls":3},"   •  Puissance thermique installée (kWth, si cogénération ou chaleur seule)",{"$nulls":4},{"$f":"'Données projet'!B13","v":0},"kW thermiques"]
[]
[]
[]
[]
[]
[{"$nulls":15},"Etapes les plus contributrices:"]
[{"$nulls":15},1,{"$f":"Feuil1!I17","v":"Méthaniseur (estimation des émissions fugitives structurelles)"}]
[null,null,"Résultats sur l'indicateur de changement climatique à horizon 100 ans",{"$nulls":12},2,{"$f":"Feuil1!I18","v":"Valorisation du digestat (séparation, stockage et épandage)"}]
[{"$nulls":15},3,{"$f":"Feuil1!I19","v":"Valorisation du biogaz en cogénération"}]
{"$rows_empty":16}
[{"$nulls":15},"•  Taux d'émissions fugitives calculé pour l'installation (en pourcentage de la production annuelle de méthane contenu dans le biogaz) :"]
[{"$nulls":22},{"$f":"'Calculs fonctionnement'!B71","v":{"v":0.05,"d":"5.00%"}}]
[{"$nulls":15},"•  Emissions fugitives hypothétiques : δ100ans =",{"$nulls":3},{"$f":"'Résultats tableau de bord'!H32","v":{"v":0,"d":"0.00"}},"kg de méthane"]
[{"$nulls":15},"Soit ",{"$f":"'Résultats tableau de bord'!E33","v":{"v":11.569354653964982,"d":"11.57"}},"% de la production annuelle de méthane contenu dans le biogaz"]
[{"$nulls":15},"Le δ correspond au seuil d’émissions fugitives au-delà duquel on observe une inversion des bénéfices de l’unité sur le changement climatique, plus l’indicateur est élevé plus le risque d’inversion des bénéfices est faible)"]
[]
[]
[]
[{"$nulls":3},"Feu tricolore :",null,{"$f":"'Calculs d''impacts'!$H$53","v":{"$error":"#VALUE!"}}]
[{"$nulls":3},"Feu rouge : situation défavorable",{"$nulls":3},"BILAN NET :",{"$f":"'Calculs d''impacts'!F53","v":{"v":0,"d":"0.00"}},"tonnes équivalent CO2",{"$nulls":5},{"$f":"IF($F$54=\"rouge\",\"l\",\"\")","v":{"$error":"#VALUE!"}},{"$f":"IF($F$54=\"orange\",\"l\",\"\")","v":{"$error":"#VALUE!"}},{"$f":"IF($F$54=\"vert\",\"l\",\"\")","v":{"$error":"#VALUE!"}}]
[{"$nulls":3},"Feu orange : zone d'incertitude"]
[{"$nulls":3},"Feu vert : situation favorable"]
[]
[{"$nulls":3},"•  Estimation par AMG d’un stockage de carbone :",{"$nulls":3},{"$f":"'Calculs d''impacts'!C47","v":{"v":0,"d":"0.00"}},"tonnes de carbone par an au sein de la matière organique du sol."]
[{"$nulls":3},"Soit un équivalent CO2 de :",null,{"$f":"'Calculs d''impacts'!C48","v":{"v":0,"d":"0.00"}},"t CO2 eq / an",null,"sous l’hypothèse du maintien des pratiques de culture des CIVE"]
[{"$nulls":3},"et de la teneur en carbone stable."]
[]
[]
[]
[]
[]
[{"$nulls":15},"Etapes les plus contributrices:"]
[{"$nulls":15},1,{"$f":"Feuil1!I3","v":"Valorisation du digestat (séparation, stockage et épandage)"}]
[null,null,"Résultats sur l'indicateur de changement climatique à horizon 20 ans",{"$nulls":12},2,{"$f":"Feuil1!I4","v":"Méthaniseur (estimation des émissions fugitives structurelles)"}]
[{"$nulls":15},3,{"$f":"Feuil1!I5","v":"Valorisation du biogaz en cogénération"}]
{"$rows_empty":24}
[{"$nulls":3},"Feu tricolore :",null,{"$f":"'Calculs d''impacts'!H52","v":{"$error":"#VALUE!"}}]
[{"$nulls":3},"Feu rouge : situation défavorable",{"$nulls":3},"BILAN :",{"$f":"'Calculs d''impacts'!F52","v":{"v":0,"d":"0.00"}},"tonnes équivalent CO2",{"$nulls":4},{"$f":"IF($F$95=\"rouge\",\"l\",\"\")","v":{"$error":"#VALUE!"}},{"$f":"IF($F$95=\"orange\",\"l\",\"\")","v":{"$error":"#VALUE!"}},{"$f":"IF($F$95=\"vert\",\"l\",\"\")","v":{"$error":"#VALUE!"}}]
[{"$nulls":3},"Feu orange : zone d'incertitude"]
[{"$nulls":3},"Feu vert : situation favorable"]
[]
[{"$nulls":3},"•  Estimation par AMG d’un stockage de carbone :",{"$nulls":3},{"$f":"'Calculs d''impacts'!$C$45","v":{"v":0,"d":"0.00"}},"tonnes de carbone par an au sein de la matière organique du sol."]
[{"$nulls":3},"Soit un équivalent CO2 de :",null,{"$f":"'Calculs d''impacts'!$C$46","v":{"v":0,"d":"0.00"}},"t CO2 eq / an",null,"sous l’hypothèse du maintien des pratiques de culture des CIVE"]
[{"$nulls":3},"et de la teneur en carbone stable."]
{"$rows_empty":7}
[null,null,"Résultats énergétiques"]
[]
[{"$nulls":3},"   •  Taux de Retour Energétique :",null,null,{"$f":"'Calculs d''impacts'!C69","v":{"$error":"#DIV/0!"}}]
[{"$nulls":3},"L’unité produit X  fois plus d’énergie qu’elle n’en dépense pour la produire. Un taux proche de 1 correspond à un gain énergétique nul. Plus le taux est élevé, meilleur est le ratio entre la production d'énergie au regard de la consommation par l'unité."]
[{"$nulls":3},"   •  Energie Valorisée :",null,{"$f":"'Calculs d''impacts'!C70","v":{"$error":"#DIV/0!"}}]
[{"$nulls":3},"   •  Répartition des consommations et substitutions d'énergie fossile et nucléaire (le seuil critique figure un niveau de consommation d’énergie qui serait supérieur aux évitements) :"]
{"$rows_empty":25}
[null,null,"Indicateur azote",{"$nulls":11},"Emissions azotées et indicateurs du pouvoir fertilisant du digestat"]
[]
[{"$nulls":3},"   •  Répartition des apports d'azote introduits dans le mélange de substrats :",{"$nulls":11},"   •  Répartition du devenir de l'azote introduit dans le mélange de substrats :"]
{"$rows_empty":14}
[{"$nulls":15},"   •  Pourcentage de l'azote valorisable au regard de l'azote introduit dans le digesteur :",{"$nulls":7},{"$f":"SUM('Calculs fonctionnement'!Z14:AB14)/'Calculs fonctionnement'!B8","v":{"$error":"#DIV/0!"}}]
[{"$nulls":15},"   •  Pourcentage de l'azote disponible pour d'autres cultures que les CIVE et cultures principales au regard de l'azote introduit dans le digesteur :"]
[{"$nulls":23},{"$f":"SUM('Calculs fonctionnement'!Z22:AB22)/'Calculs fonctionnement'!B8","v":{"$error":"#DIV/0!"}}]
[{"$nulls":15},"   •  Unité d'azote exportée et générant des évitements de fertilisants  :",{"$nulls":6},{"$f":"SUM('Calculs fonctionnement'!Z22:AB22)","v":{"v":0,"d":"0.00"}},"UN/an"]
[{"$nulls":15},"   •  Equivalences en surface de SAU fertilisée (pour une dose de 170 UN/ha, hors CIVE et cultures principales) :"]
[{"$nulls":22},{"$f":"W161/170","v":{"v":0,"d":"0.00"}},"ha de SAU/an"]
[]
[]
[]
[null,null,"Résultats Economie circulaire et Enjeux Biodiversité"]
[]
[{"$nulls":4},"1. Gestion des cultures - méthanisation agricole"]
[{"$nulls":4},"SAU occuppé par les cultures principales ",{"$nulls":7},{"$f":"'Données projet'!B100","v":{"v":0,"d":"0%"}},{"$nulls":6},"%"]
[{"$nulls":4},"SAU occupé par les CIVE d'été :",{"$nulls":7},{"$f":"'Données projet'!B101","v":{"v":0,"d":"0%"}},{"$nulls":6},"%"]
[{"$nulls":4},"SAU occupé par les CIVE d'hiver :",{"$nulls":7},{"$f":"'Données projet'!B102","v":{"v":0,"d":"0%"}},{"$nulls":6},"%"]
[{"$nulls":4},"SAU occupé par les prairies :",{"$nulls":7},{"$f":"'Données projet'!B103","v":{"v":0,"d":"0%"}},{"$nulls":6},"%"]
[{"$nulls":4},"2. Gestion des CIVE"]
[{"$nulls":4},"Irrigation des CIVE :",{"$nulls":7},{"$f":"'Données projet'!B105","v":"Votre choix"}]
[{"$nulls":4},"Usage de perticides sur les CIVE :",{"$nulls":7},{"$f":"'Données projet'!B106","v":"Votre choix"}]
[{"$nulls":4},"Fertilisation minérale des CIVE :",{"$nulls":7},{"$f":"'Données projet'!B107","v":"Votre choix"}]
[{"$nulls":4},"Pratique de techniques culturales simplifiées sur les CIVE :",{"$nulls":7},{"$f":"'Données projet'!B108","v":"Votre choix"}]
[{"$nulls":4},"Au moins une des CIVE est cultivée avec au moins deux espèces végétales différentes :",{"$nulls":7},{"$f":"'Données projet'!B109","v":"Votre choix"}]
[{"$nulls":4},"3. Exploitation"]
[{"$nulls":4},"% de substitution des engrais minéraux sur l'exploitation :",{"$nulls":7},{"$f":"'Données projet'!B111","v":{"v":0,"d":"0%"}},{"$nulls":6},"%"]
[{"$nulls":4},"L'exploitation a obtenu une certification HVE niveau 3  :",{"$nulls":7},{"$f":"'Données projet'!B112","v":"Votre choix"}]
[{"$nulls":4},"L'exploitation a obtenu une certification Agriculture Biologique :",{"$nulls":7},{"$f":"'Données projet'!B113","v":"Votre choix"}]
[{"$nulls":4},"L'exploitation a réalisé des bilans humiques et/ou des analyses de la qualité des sols :",{"$nulls":7},{"$f":"'Données projet'!B114","v":"Votre choix"}]
[{"$nulls":4},"4. Economie circulaire et Intégration dans le territoire"]
[{"$nulls":4},"L'exploitation est gouvernée localement :",{"$nulls":7},{"$f":"'Données projet'!B116","v":"Votre choix"}]
[{"$nulls":4},"Hauteur du financement de l'exploitation par des acteurs locaux (agriculteurs, collectivités, citoyens, entreprises…) :",{"$nulls":7},{"$f":"'Données projet'!B117","v":"Votre choix"}]
[{"$nulls":4},"Hauteur de l'implication de la collectivité locale dans l'exploitation (approvisionnement en biodéchets, achat d'énergie, concertation…) :",{"$nulls":7},{"$f":"'Données projet'!B118","v":"Votre choix"}]
[{"$nulls":4},"Hauteur de la valorisation du digestat sur les terres des actionnaires agricoles :",{"$nulls":7},{"$f":"'Données projet'!B119","v":"Votre choix"}]
[{"$nulls":4},"5.  Plateforme et aménagement du site de méthanisation "]
[{"$nulls":4},"Surface du site de méthanisation :",{"$nulls":7},{"$f":"'Données projet'!B121","v":0}]
[{"$nulls":4},"Le site de méthanisation a été installé sur une surface déjà artificialisée :",{"$nulls":7},{"$f":"'Données projet'!B122","v":"Votre choix"}]
[{"$nulls":4},"% de surface au sol imperméabilisée par l'installation :",{"$nulls":7},{"$f":"'Données projet'!B123","v":{"v":0.8,"d":"80%"}},{"$nulls":6},"%"]
[{"$nulls":4},"Prise en compte des préconisations de l'ICPE dans l'intégration paysagère du projet :",{"$nulls":7},{"$f":"'Données projet'!B124","v":"Votre choix"}]
[{"$nulls":4},"Nombre de mètres de linéaires de haies plantés sur l'installation :",{"$nulls":7},{"$f":"'Données projet'!B125","v":0},{"$nulls":6},"m"]

{"sheet":"Résultats bruts","index":19,"n_rows":46,"n_cols":5,"rows_kept":46,"merged":[[3,1,3,5],[6,2,16,2],[17,2,22,2],[23,2,23,3],[28,2,38,2],[39,2,44,2],[45,2,45,3]]}
[]
[]
[]
[null,"Diagnostic DIGES 3 - Résultats bruts"]
[]
[null,null,"1) Résultats d'impact sur le changement climatique à horizon 100 ans",null,"Impact sur le changement climatique à horizon 100 ans (tonnes équivalent CO2)"]
[null,null,"Emissions générées par l’unité","  Production de substrats cultivés (cultures dédiées)",{"$f":"'Calculs d''impacts'!C62","v":{"v":0,"d":"0.00"}}]
[{"$nulls":3},"  Production de substrats cultivés (CIVE)",{"$f":"'Calculs d''impacts'!D62","v":{"v":0,"d":"0.00"}}]
[{"$nulls":3},"  Stockage des effluents bruts",{"$f":"'Calculs d''impacts'!E62","v":{"v":0,"d":"0.00"}}]
[{"$nulls":3},"  Transport des substrats",{"$f":"'Calculs d''impacts'!F62","v":{"v":0,"d":"0.00"}}]
[{"$nulls":3},"  Prétraitement",{"$f":"'Calculs d''impacts'!G62","v":{"v":0,"d":"0.00"}}]
[{"$nulls":3},"  Méthaniseur",{"$f":"'Calculs d''impacts'!H62","v":{"v":0,"d":"0.00"}}]
[{"$nulls":3},"  Méthaniseur (estimation des émissions fugitives structurelles)",{"$f":"'Calculs d''impacts'!I62","v":{"v":0,"d":"0.00"}}]
[{"$nulls":3},"  Valorisation du biogaz en cogénération",{"$f":"'Calculs d''impacts'!J62","v":{"v":0,"d":"0.00"}}]
[{"$nulls":3},"  Valorisation du biogaz en injection (biométhane et BioGNV)",{"$f":"'Calculs d''impacts'!K62","v":{"v":0,"d":"0.00"}}]
[{"$nulls":3},"  Valorisation du digestat (séparation, stockage et épandage)",{"$f":"'Calculs d''impacts'!L62","v":{"v":0,"d":"0.00"}}]
[{"$nulls":3},"  Valorisation du digestat (transport)",{"$f":"'Calculs d''impacts'!M62","v":{"$error":"#VALUE!"}}]
[null,null,"Emissions évitées par les filières de références","  Evitées par la substitution de diesel (CIVE à la place de CIPAN)",{"$f":"'Calculs d''impacts'!N63","v":{"v":0,"d":"0.00"}}]
[{"$nulls":3},"  Evitées par la substitution d'énergie",{"$f":"'Calculs d''impacts'!O63","v":{"v":0,"d":"0.00"}}]
[{"$nulls":3},"  Evitées par la substitution de traitement de déchets et d'effluents",{"$f":"'Calculs d''impacts'!P63","v":{"v":0,"d":"0.00"}}]
[{"$nulls":3},"  Evitées par la substitution de transport de déchets",{"$f":"'Calculs d''impacts'!Q63","v":{"v":0,"d":"0.00"}}]
[{"$nulls":3},"  Evitées par la substitution d'engrais",{"$f":"'Calculs d''impacts'!R63","v":{"v":0,"d":"0.00"}}]
[{"$nulls":3},"  Evitées par la production de CO2 biogénique (évitement du transport de CO2 fossile)",{"$f":"'Calculs d''impacts'!S63","v":{"v":0,"d":"0.00"}}]
[null,null,"BILAN NET",null,{"$f":"SUM(E7:E23)","v":{"$error":"#VALUE!"}}]
[]
[]
[]
[null,null,"2) Résultats d'impacts sur l'utilisation de ressources fossiles et nucléaires",null,"Ressources fossiles et nucléaires (kWh eq)"]
[null,null,"Energie fossile et nucléaire consommée par l'unité","  Production de substrats cultivés (cultures dédiées)",{"$f":"'Calculs d''impacts'!C65","v":{"v":0,"d":"0.00"}}]
[{"$nulls":3},"  Production de substrats cultivés (CIVE)",{"$f":"'Calculs d''impacts'!D65","v":{"v":0,"d":"0.00"}}]
[{"$nulls":3},"  Stockage des effluents bruts et biodéchets",{"$f":"'Calculs d''impacts'!E65","v":{"v":0,"d":"0.00"}}]
[{"$nulls":3},"  Transport des substrats",{"$f":"'Calculs d''impacts'!F65","v":{"v":0,"d":"0.00"}}]
[{"$nulls":3},"  Prétraitement",{"$f":"'Calculs d''impacts'!G65","v":{"v":0,"d":"0.00"}}]
[{"$nulls":3},"  Méthaniseur",{"$f":"'Calculs d''impacts'!H65","v":{"v":0,"d":"0.00"}}]
[{"$nulls":3},"  Méthaniseur (estimation des émissions fugitives structurelles)",{"$f":"'Calculs d''impacts'!I65","v":{"v":0,"d":"0.00"}}]
[{"$nulls":3},"  Valorisation du biogaz en cogénération",{"$f":"'Calculs d''impacts'!J65","v":{"v":0,"d":"0.00"}}]
[{"$nulls":3},"  Valorisation du biogaz en injection (biométhane et BioGNV)",{"$f":"'Calculs d''impacts'!K65","v":{"v":0,"d":"0.00"}}]
[{"$nulls":3},"  Valorisation du digestat (séparation, stockage et épandage)",{"$f":"'Calculs d''impacts'!L65","v":{"v":0,"d":"0.00"}}]
[{"$nulls":3},"  Valorisation du digestat (transport)",{"$f":"'Calculs d''impacts'!M65","v":{"$error":"#VALUE!"}}]
[null,null,"Energie fossile et nucléaire évitée par les filières de références","  Evitées par la substitution de diesel (CIVE à la place de CIPAN)",{"$f":"'Calculs d''impacts'!N66","v":{"v":0,"d":"0.00"}}]
[{"$nulls":3},"  Evitées par la substitution d'énergie",{"$f":"'Calculs d''impacts'!O66","v":{"v":0,"d":"0.00"}}]
[{"$nulls":3},"  Evitées par la substitution de traitement de déchets et d'effluents",{"$f":"'Calculs d''impacts'!P66","v":{"v":0,"d":"0.00"}}]
[{"$nulls":3},"  Evitées par la substitution de transport de déchets",{"$f":"'Calculs d''impacts'!Q66","v":{"v":0,"d":"0.00"}}]
[{"$nulls":3},"  Evitées par la substitution d'engrais",{"$f":"'Calculs d''impacts'!R66","v":{"v":0,"d":"0.00"}}]
[{"$nulls":3},"  Evitées par la production de CO2 biogénique (évitement du transport de CO2 fossile)",{"$f":"'Calculs d''impacts'!S66","v":{"v":0,"d":"0.00"}}]
[null,null,"BILAN NET",null,{"$f":"SUM(E29:E45)","v":{"$error":"#VALUE!"}}]

{"sheet":"BDD ITK culture","index":20,"n_rows":40,"n_cols":19,"rows_kept":40,"hidden":true}
[]
[]
[{"$nulls":8},"Epandage différencier en ferti minéral et orga",null,"destruction chimique ?"]
[null,null,"Nombre de passages réalisés","Déchaumage","Labour","Reprise (Chisel)","Préparation lit (vibroculteur)","Semis","Fertilisation minérale","Fertilisation organique","Protection des plantes (épandeur porté)","Récolte (ensileuse)","Transport sur l'exploitation"]
[null,null,"ITK CIPAN",2,0,0,0,1,0,0,1,0,0]
[null,null,"ITK simplifié",0,0,0,0,1,0,1,0,1,0,"En semis direct"]
[null,null,"ITK moyen",1,0,0,0,1,1,1,1,1,0]
[null,null,"ITK soutenu",1,0,1,1,1,2,1,1,1,0,"labour plutôt sur la culture suivante","ferti un orga et un min en complément"]
[{"$nulls":11},"Fauchage pluis andennage"]
[null,null,"Agribalyse 3.1",{"$nulls":8},"zone d'élevage, préfannage puis ramassage"]
[null,null,"Nom renseigné","Cover-crop, cover-crop 4m","Ploughing","Cultivateur chisel 4.5m","Vibroculteur, 5m","Semis combi, semoir, mécanique","Epandage azote liquide, pulvérisateur, trainé 2500l","Epandage fumier","Protection phytosanitaire, avec le pulvérisateur 2500l","Ensilage (ensileuse 600 cv avec benne attelée)","Transport maïs fourrage 110 cv, benne, 2 essieux -15 t",{"$nulls":4},"Epandage lisier","Epandage fumier"]
[null,null,"Nom de l'inventaire","Soil maintenance, with cover crop 4m/hr/FR","Ploughing, with 5 or 6 soc plough/hr/FR","Soil decompactation, with 4.5m chisel/hr/FR","Harrowing, with vibrating tine cultivator (standard equipment) 5m/hr/FR","Sowing or planting, with classic seeder and harrow/hr/FR","Fertilizing or plant protection, with sprayer, 2500 l/hr/FR","Fertilizing,   solid   manure   or   compost   (charging   and spreading), with frontal bucket and 5t spreader/hr/FR","Fertilizing or plant protection, with sprayer, 2500 l/hr/FR","Harvesting silage grass, with hay chopper and blower/hr/FR","Transporting to farm, with trailer (<15t) heavy tractor/hr/FR",{"$nulls":4},"Fertilizing, slurry, with tanker/hr/FR","Fertilizing,   solid   manure   or   compost   (charging   and spreading), with frontal bucket and 5t spreader/hr/FR"]
[null,null,"Consommation diesel (L/ha)",10,24.9,15.75,5.1,13.97,1.04,{"$f":"S13","v":6.1},1.04,26.8,15.13,"Agibalyse V3.1 - Annexe J, tableau 153 - Colonne \"Conso. Carburant par hectare\". p. 289",null,null,"Consommation diesel (L/ha)",5,6.1]
[{"$nulls":16},"Consommation diesel (L/h)",5,4.88]
[null,null,"L de Diesel / ha",{"$nulls":10},"Total en L par hectare","Total en kg par hectare"]
[null,null,"ITK CIPAN",{"$f":"D5*D$13","v":20},0,0,0,13.97,0,{"$f":"J5*J$13","v":0},1.04,0,0,{"$f":"SUM(D16:M16)","v":35.01},{"$f":"SUM(D16:M16)*'BDD modélisation ICV'!$A$135","v":29.058299999999996}]
[null,null,{"$f":"C6","v":"ITK simplifié"},{"$f":"D6*D$13","v":0},0,0,0,13.97,0,{"$f":"J6*J$13","v":6.1},0,26.8,0,{"$f":"SUM(D17:M17)","v":{"v":46.870000000000005,"d":"46.87"}},{"$f":"SUM(D17:M17)*'BDD modélisation ICV'!$A$135","v":38.902100000000004}]
[null,null,{"$f":"C7","v":"ITK moyen"},{"$f":"D7*D$13","v":10},0,0,0,13.97,1.04,{"$f":"J7*J$13","v":6.1},1.04,26.8,0,{"$f":"SUM(D18:M18)","v":58.95},{"$f":"SUM(D18:M18)*'BDD modélisation ICV'!$A$135","v":48.9285}]
[null,null,{"$f":"C8","v":"ITK soutenu"},{"$f":"D8*D$13","v":10},0,15.75,5.1,13.97,2.08,{"$f":"J8*J$13","v":6.1},1.04,26.8,0,{"$f":"SUM(D19:M19)","v":80.84},{"$f":"SUM(D19:M19)*'BDD modélisation ICV'!$A$135","v":67.0972}]
[]
[]
[null,null,"20% légumineuses dans CIVE => évitement de 20 UN/ha (bonne pratique pour qualité des sols?)"]
[null,null,"diminution rendement sur culture suivante si CIVE"]
[null,null,"stockage carbone par CIVE"]
[]
[{"$nulls":4},"Légende :"]
[null,null,"Non concerné",null,"Sources des données","Référence"]
[null,null,{"$f":"C17","v":"ITK simplifié"},null,"Cellule verte","Cellule dont la valeur numérique est utilisée et modifiable"]
[null,null,{"$f":"C18","v":"ITK moyen"},null,"Cellule orange","Cellule remplie par une formule qui utilisée et modifiable"]
[null,null,{"$f":"C19","v":"ITK soutenu"},null,"Cellule rouge","Cellule non utilisé dans le reste du calculateur"]
{"$rows_empty":7}
[null,null,"Fauche (faucheuse de 7m, traction 300 cv)","Fanage andainage avec faneuse andaineuse 3 m","Pressage foin (4 t ms/ha) avec presse ronde"]
[null,null,"Mowing, with rotary mower 7m/hr/FR","Haying, with tedder/hr/FR","Baling, with round baler (straw)/ha/FR"]
[null,null,4.23,1,11.7,{"$f":"SUM(C40:E40)","v":16.93}]

{"sheet":"BDD modélisation ICV","index":21,"n_rows":177,"n_cols":12,"rows_kept":177,"hidden":true,"merged":[[38,3,39,3],[47,7,48,7],[164,1,169,1]]}
[]
["Traitements des substrats et digestats"]
["JRC 2017 (p.43) // REDII","Consommation électrique (kWh/t de matière entrante)","Consommation thermique  (kWh/t de matière entrante)","Consommation de diesel (L de diesel/t MS de substrat en sortie)","Emission de CH4 (g CH4 /kg MS de CIVE en sortie)","Emission de N2O (g N2O / kg MS de CIVE en sortie)"]
["Broyage",8,{"$nulls":5}," GT Biogaz du Comité Stratégique de filière"]
["Hygiénisation",null,170,{"$nulls":4},"Vargas et al., 2015"]
["Tassement de silos d'ensilage",null,null,1.775707481,8.0951e-05,0.00019942,"63,375 MJ/t de MS de substrat <=> 63,375 (MJ/t substrat)/35,69 (MJ/L diesel)=1,775707481 L diesel/t substrat","10% de perte en MS (valeur JRC 2017)"]
["Presse à vis",0.6,{"$nulls":5},"Vargas et al. 2017 (Quantis)"]
["Centrifugeuse",{"$f":"B7*2","v":1.2},{"$nulls":4},"hypothèse de consommation d'une centrifugeuse : presse à vis*2"]
[]
["Taux d'expression de BMP"]
["TSH","Récupération biogaz (du digestat brut OU liquide)","Taux d'expression du BMP (%)"]
[">80j","oui",100,{"$nulls":4},"Sys-métha (Bareha et al., 2021)"]
[">80j","non",95,{"$nulls":4},"Sys-métha (Bareha et al., 2021)"]
["<80j","oui",95,{"$nulls":4},"Sys-métha (Bareha et al., 2021)"]
["<80j","non",90,{"$nulls":4},"Sys-métha (Bareha et al., 2021)"]
[]
[]
[]
[]
["Légende :"]
["Sources des données","Référence"]
["Cellule verte","Cellule dont la valeur numérique est utilisée et modifiable"]
["Cellule orange","Cellule remplie par une formule qui utilisée et modifiable"]
["Cellule rouge","Cellule non utilisé dans le reste du calculateur"]
{"$rows_empty":7}
["Consommations énergétiques en épuration/injection"]
["Usage","% consommation biogaz (DREAL Bretagne 2022)","% consommation énergie primaire (ADEME grand ouest 2022)","% kWh vendus "]
["Chauffage",{"v":0.06,"d":"6%"},{"v":0.03,"d":"3%"}]
["Electricité",null,{"v":0.07,"d":"7%"}]
["Total",null,null,{"v":0.091,"d":"9%"}]
[]
["Procédé","Consommation d'électricité","Unité","% consommation électrique de l'unité de méthanisation","Pertes"]
["Epuration (DREAL Bretagne)",0.35,"kWh/Nm3 de gaz entrant",61,{"$nulls":3},"DREAL Bretagne, 2022"]
["Injection dans le réseau",0.12,"kWh/Nm3 de gaz entrant",null,{"v":1E-3,"d":"0.10%"},"0,1% de pertes à l'injection","Données pour un réseau de MPC 16 bars (montée en pression à 17 bars)","Rex GrDF, ACV ENEA Consulting/Quantis, 2017"]
["Conso de tétrahydrothiophène",0.0275,"g de THT/Nm3",null,null,"seulement en injection directe dans le réseau",null,"GESTi'métha"]
["Injection directe en station GNV",0.267,"kWh/kg GNC",null,{"$f":"0.09%+0.92%","v":{"v":0.0101,"d":"1.01%"}},"0,09% de pertes au remplissage du réservoir à la station","0,92% du biométhane du réservoir sont imbrulés","Clark et al., 2017"]
["Capture du CO2",0.35,"kWh/kg CO2 valorisé",{"$nulls":4},"CTBM, 2020; CTBM & CSF NSE - GT Biogaz, 2023"]
["Conso électrique (hors épuration)",0.49,"kWh/Nm3 de CH4 produit",{"$nulls":4},"DREAL Bretagne 2020"]
[]
["Rendement de l'épurateur"]
[null,"Rendement (% du CH4 transformé en biométhane)","Off-gaz","Pureté du biométhane"]
["Membranaire",{"v":0.993,"d":"99.3%"},{"$f":"1-B48","v":{"v":0.007000000000000006,"d":"0.7%"}},{"v":0.97,"d":"97.0%"},{"$nulls":3},"COPIL et RED II (Solagro, INRAE Transfert, 2022)"]
["PSA",{"v":0.97,"d":"97%"},{"$f":"1-B49","v":{"v":0.030000000000000027,"d":"3.0%"}}]
[]
["Consommation de charbon actif",0.15,"g/Nm3 de biogaz",{"$nulls":4},"Esnouf et al., 2021; Vargas et al., 2015, Calculateur GES’ti métha"]
[]
[null,"Rendement (% du CO2 des off gaz qui est capté)"]
["Capture et liquéfaction du CO2",{"v":0.9,"d":"90.0%"},{"$nulls":5},"CTBM & CSF NSE - GT Biogaz, 2023"]
[]
["Consommations énergétiques en cogénération"]
["Usage","%  production électrique (PROdige)","%  production électrique (ADEME Grand Est 2022)","% consommation électrique (DREAL Bretagne 2021)","% chaleur produite (PROdige)","%  autoconsommation thermique (ADEME Grand Est 2022)"]
["Consommation d'électricité",{"v":0.1,"d":"10%"},{"v":0.14,"d":"14.0%"}]
["Consommations auxiliaires",null,null,{"v":0.045,"d":"4.5%"}]
["Valorisation thermique",null,{"v":0.29,"d":"29.0%"},null,{"v":0.57,"d":"57.0%"},{"v":0.22,"d":"22.0%"}]
["Consommation électrique",0.39,"kWh/Nm3 de CH4 produit","DREAL Bretagne 2020"]
[]
["Rendement en cogénération"]
[null,"Cogénérateur"]
["Taux de conversion électrique (%)",{"v":0.397,"d":"39.7%"},{"$nulls":5},"ADEME & APCA, 2022"]
["Taux de conversion thermique (%)",{"v":0.4,"d":"40.0%"},{"$nulls":5},"RED II et Bilan IDF 2020 / AREC IDF, 2022"]
["Chaleur valorisée (%)",{"v":0.57,"d":"57.0%"},{"$nulls":5},"PROdige"]
[]
["Gaz torché et imbrulés"]
[null,"% du gaz (après émissions fugitives)","kg N20/kWh brûlé "]
["Gaz torché",{"v":0.015,"d":"1.5%"},{"v":3.6e-07,"d":"3.60E-07"},{"$nulls":4},"AREC IDF, 2022;"]
["Imbrulés en torchère",{"v":0.03,"d":"3.0%"},{"$nulls":5},"INRAE Transfert, Esnouf, 2021"]
["Imbrulés en cogé",{"v":0.017,"d":"1.7%"},{"$nulls":5},"Berger et al., 2022; JRC European commission, 2017"]
[]
["Traitement de l'air viscié"]
["Quantité d'air traité",374,"m3/Nm3 d'air traité",{"$nulls":4},"Ges'ti métha"]
["Conso eau",5e-06,"m3/Nm3 d'air traité",{"$nulls":4},"Ges'ti métha"]
["Conso électricité",1E-3,"kWh/Nm3 de biogaz",{"$nulls":4},"Ges'ti métha"]
[]
["Taux de capture en phase solide selon le type de séparation du digestat"]
[null,"Centrifugeuse","Presse à vis"]
["MB",{"v":0.29,"d":"29%"},{"v":0.1,"d":"10%"}]
["MS",{"v":0.81,"d":"81%"},{"v":0.32,"d":"32%"},{"$nulls":4},"Bareha et al., 2022"]
["MO",{"v":0.83,"d":"83%"},{"v":0.38,"d":"38%"},"Taux de capture MO= taux de capture C",{"$nulls":3},"Bareha et al., 2023"]
["Norg",{"v":0.78,"d":"78%"},{"v":0.19,"d":"19%"},{"$nulls":4},"Bareha et al., 2024"]
["NH4+",{"v":0.29,"d":"29%"},{"v":0.1,"d":"10%"},{"$nulls":4},"Bareha et al., 2025"]
["P",{"v":0.92,"d":"92%"},{"v":0.28,"d":"28%"},{"$nulls":4},"Bareha et al., 2026"]
["K",{"v":0.45,"d":"45%"},{"v":0.11,"d":"11%"},{"$nulls":4},"Bareha et al., 2027"]
[{"$nulls":7},"Bareha et al., 2028"]
["Taux de dégradation et facteurs d'émissions au stockage du digestat",{"$nulls":3},"Méthasim"]
["Taux de dégradation"]
[null,"Digestat brut","Phase liquide","Phase solide",null,"Digestat solide","Phase liquide non couverte","Phase liquide couverte","Phase brut non couverte","Phase brut couverte"]
["MS",{"$f":"IF('Données projet'!$B$91=\"Ouvert\",'BDD modélisation ICV'!I93,'BDD modélisation ICV'!J93)","v":{"v":0.04,"d":"4%"}},{"$f":"IF('Données projet'!$B$90=\"Ouvert\",'BDD modélisation ICV'!G93,'BDD modélisation ICV'!H93)","v":{"v":0.07,"d":"7%"}},{"$f":"'BDD modélisation ICV'!F93","v":{"v":0.22,"d":"22%"}},null,{"v":0.22,"d":"22%"},{"v":0.07,"d":"7%"},{"v":0.07,"d":"7%"},{"v":0.04,"d":"4%"},{"v":0.04,"d":"4%"},null,"Bareha et al., 2021"]
["MV",{"$f":"IF('Données projet'!$B$91=\"Ouvert\",'BDD modélisation ICV'!I94,'BDD modélisation ICV'!J94)","v":{"v":0.06,"d":"6%"}},{"$f":"IF('Données projet'!$B$90=\"Ouvert\",'BDD modélisation ICV'!G94,'BDD modélisation ICV'!H94)","v":{"v":0.09,"d":"9%"}},{"$f":"'BDD modélisation ICV'!F94","v":{"v":0.3,"d":"30%"}},null,{"v":0.3,"d":"30%"},{"v":0.09,"d":"9%"},{"v":0.09,"d":"9%"},{"v":0.06,"d":"6%"},{"v":0.06,"d":"6%"},null,"Bareha et al., 2022"]
["Norg",{"$f":"IF('Données projet'!$B$91=\"Ouvert\",'BDD modélisation ICV'!I95,'BDD modélisation ICV'!J95)","v":{"v":0,"d":"0%"}},{"$f":"IF('Données projet'!$B$90=\"Ouvert\",'BDD modélisation ICV'!G95,'BDD modélisation ICV'!H95)","v":{"v":0,"d":"0%"}},{"$f":"'BDD modélisation ICV'!F95","v":{"v":0.09,"d":"9%"}},null,{"v":0.09,"d":"9%"},{"v":0,"d":"0%"},{"v":0,"d":"0%"},{"v":0,"d":"0%"},{"v":0,"d":"0%"},null,"Bareha et al., 2023"]
["NH4+",{"$f":"IF('Données projet'!$B$91=\"Ouvert\",'BDD modélisation ICV'!I96,'BDD modélisation ICV'!J96)","v":{"v":0.07,"d":"7%"}},{"$f":"IF('Données projet'!$B$90=\"Ouvert\",'BDD modélisation ICV'!G96,'BDD modélisation ICV'!H96)","v":{"v":0.09,"d":"9%"}},{"$f":"'BDD modélisation ICV'!F96","v":{"v":0.51,"d":"51%"}},null,{"v":0.51,"d":"51%"},{"v":0.44,"d":"44%"},{"v":0.09,"d":"9%"},{"v":0.36,"d":"36%"},{"v":0.07,"d":"7%"},null,"Bareha et al., 2024"]
["CT",{"$f":"IF('Données projet'!$B$91=\"Ouvert\",'BDD modélisation ICV'!I97,'BDD modélisation ICV'!J97)","v":{"v":0.06,"d":"6%"}},{"$f":"IF('Données projet'!$B$90=\"Ouvert\",'BDD modélisation ICV'!G97,'BDD modélisation ICV'!H97)","v":{"v":0.09,"d":"9%"}},{"$f":"'BDD modélisation ICV'!F97","v":{"v":0.34,"d":"34%"}},null,{"v":0.34,"d":"34%"},{"v":0.09,"d":"9%"},{"v":0.09,"d":"9%"},{"v":0.06,"d":"6%"},{"v":0.06,"d":"6%"},null,"Bareha et al., 2025"]
[]
["Facteur d'émission au stockage des digestats et des effluents d'élevage"]
[null,"Digestat brut","Phase liquide","Phase solide",{"$nulls":3},"Lisier","Fumier"]
["Méthane",{"v":0.58,"d":"58%"},{"v":0.58,"d":"58%"},{"v":0.01,"d":"1%"},"du carbone biodégradé durant le stockage (le reste du carbone dégradé est émis sous forme de CO2)","Bareha et al., 2021","CH4",0.36,0.015,"Taux d'expression du BMP",null,"DIGES 2"]
["Ammoniac",{"v":0.36,"d":"36%"},{"v":0.44,"d":"44%"},{"v":0.44,"d":"44%"},"de l'azote ammoniacal entrant le stockage (pour le digestat solide, il s'agit de la part de l'azote ammoniacal dégradé durant le stockage)","Bareha et al., 2022","NH3",0.11,0.32,"N-NH3 / N-NH4",null,"EMEP/EEA, 2019, Tier 2"]
["Protoxyde d'azote",{"v":0,"d":"0%"},{"v":0,"d":"0%"},{"v":0.16,"d":"16%"},"de l'azote ammoniacal entrant le stockage (pour le digestat solide, il s'agit de la part de l'azote ammoniacal dégradé durant le stockage)","Bareha et al., 2023","NOx ",1E-4,0.01,"N-Nox / Ntot",null,"EMEP/EEA, 2019, Tier 2"]
[{"$nulls":6},"N2O",0.0008,0.02,"N-N2O / Ntot",null,"INRA, 2013"]
["Facteurs d'émissions à l'épandage des digestats et des effluents d'élevage"]
[null,"Digestat brut","Phase liquide","Phase solide","Fertilisants minéraux",null,null,"Lisier","Fumier"]
["Ammoniac (Brockmann, 2018)",0.6,0.6,0.8,null,"N-NH3 / N-NH4","Ammoniac (Brockmann, 2018)",0.4,0.7,"N-NH3 / N-NH4"]
["Oxydes d'azote (Brockmann, 2018)",0.026,0.026,0.026,0.026,"N-Nox / Ntot","Oxydes d'azote (Brockmann, 2018)",0.026,0.026,"N-Nox / Ntot"]
["Ammoniac et Oxydes d'azote (IPCC, 2019)",0.21,0.21,0.21,0.11,"N-NH3 + N-Nox / Ntot","Ammoniac et Oxydes d'azote (IPCC, 2019)",0.21,0.21,"N-NH3 + N-Nox / Ntot","Utilisé pour l'épandage sur CIVE et Cultures principaless"]
["Protoxyde d'azote indirect (IPCC, 2019)",0.01,0.01,0.01,0.01,"N-N2O / (N-NH3 + N-Nox)","Protoxyde d'azote indirect (IPCC, 2019)",0.01,0.01,"N-N2O / (N-NH3 + N-Nox)"]
["Nitrate (IPCC, 2019)",0.24,0.24,0.24,0.24,"N-O3- / Ntot","Nitrate (IPCC, 2019)",0.24,0.24,"N-O3- / Ntot"]
["Protoxyde d'azote indirect (IPCC, 2019)",0.011,0.011,0.011,0.011,"N-N2O / (N-NO3-)","Protoxyde d'azote indirect (IPCC, 2019)",0.011,0.011,"N-N2O / (N-NO3-)"]
["Protoxyde d'azote directe (IPCC, 2019)",0.006,0.006,0.006,0.016,"N-N2O / Ntot","Protoxyde d'azote directe (IPCC, 2019)",0.006,0.006,"N-N2O / Ntot"]
[]
["Taux d'abattement de la volatilisation du NH3"]
["Digestat brut et liquide",null,null,"Digestat solide"]
["Matériel d'épandage","Taux d'abattement (%)",null,"Matériel d'épandage","Taux d'abattement (%)"]
["Buse",0,null,"Sans incorporation",0,null,null,"TepLis+, CUMA Ouest, 2022 et Martin & Mathias, 2013"]
["Pendillard",{"v":0.7,"d":"0.70"},null,"Incorporation dans les 12h",0.45,null,null,"TepLis+, CUMA Ouest, 2022 et Martin & Mathias, 2014"]
["Enfouisseur",{"v":0.9,"d":"0.90"},null,"Incorporation dans les 4h",{"v":0.6,"d":"0.60"},null,null,"TepLis+, CUMA Ouest, 2022 et Martin & Mathias, 2015"]
["Votre choix",{"v":0,"d":"0.00"},null,"Incorporation directe",{"v":0.9,"d":"0.90"},null,null,"TepLis+, CUMA Ouest, 2022 et Martin & Mathias, 2016"]
["Débit de chantier (tMB / h)",16,null,"Débit de chantier (tMB / h)",8,null,null,"INRAE Transfert, Esnouf, 2021"]
[]
["Taux de minéralisation de l'azote organique après épandage sur les sols agricoles"]
[null,"Digestat brut","Phase liquide","Phase solide","Lisier","Fumier"]
["Taux de minéralisation",0.67,0.75,0.67,0.67,0.67,null,"(Brockmann, 2018)"]
[]
[]
["Conversion flux de gaz"]
[null,"CH4","CO2","N2O","biométhane (97%)"]
["kg/Nm3",0.7138405532171336,1.9630615213471174,1.8724,{"$f":"0.97*massevol_CH4+0.03*massevol_CO2","v":0.7513171822610331},null,null,"Dans les conditions standard (1,013 bar, 15°C) - https://encyclopedia.airliquide.com/fr/protoxyde-azote"]
[]
["Conversion CH4/Diesel"]
[1,"litre de diesel"]
[{"$f":"A134*0.83","v":0.83},"kg de diesel",null,"PCI","MJ/kg",null,"kWh/kg"]
[{"$f":"A135*E137","v":35.69},"MJ de diesel",null,"CH4",50,"RED II Annexe 3. p. 143",{"$f":"E136/3.6","v":13.88888888888889},"RED II"]
[{"$f":"A136/E136","v":{"v":0.7138,"d":"0.71"}},"kg de CH4",null,"Diesel",43,"RED II Annexe 3. p. 144",{"$f":"E137/3.6","v":11.944444444444445},"RED II"]
[{"$f":"A137/massevol_CH4/0.97*massevol_biométhane","v":{"v":0.774509793814433,"d":"0.77"}},"kg de biométhane",null,"biométhane",{"$f":"97%*PCI_CH4+3%*PCI_diesel","v":49.79},null,{"$f":"E138/3.6","v":13.830555555555556}]
[]
[1,"kg de CH4"]
[{"$f":"E136","v":50},"MJ de CH4"]
[{"$f":"A141/E137","v":{"v":1.1627906976744187,"d":"1.16"}},"kg de diesel"]
[{"$f":"1.16/0.83","v":{"v":1.3975903614457832,"d":"1.40"}},"L de diesel"]
[]
[1,"kg de diesel"]
[{"$f":"E137","v":43},"MJ de diesel"]
[{"$f":"A146/E136","v":0.86},"kg de CH4"]
[{"$f":"A147/massevol_CH4/0.97*massevol_biométhane","v":{"v":0.9331443298969071,"d":"0.93"}},"kg de biométhane"]
[]
[1,"kg biométhane"]
[{"$f":"A150/massevol_biométhane","v":{"v":1.3309957812898336,"d":"1.33"}},"Nm3 de biométhane"]
[{"$f":"A151*97%","v":{"v":1.2910659078511386,"d":"1.29"}},"Nm3 de CH4"]
[{"$f":"A152*massevol_CH4","v":{"v":0.9216152019002376,"d":"0.92"}},"kg de CH4"]
[]
[1,"MWh CH4"]
[{"$f":"A155*1000*3.6","v":3600},"MJ CH4"]
[{"$f":"A156/PCI_CH4","v":72},"kg CH4"]
[{"$f":"A157/massevol_CH4/0.97*massevol_biométhane","v":{"v":78.12371134020619,"d":"78.12"}},"kg biométhane"]
[]
[]
[]
["% d'abattement des émisions fugitives au regard de la production primaire"]
[null,null,"Torchère manuelle","Torchère automatique"]
[null,"Valeur de départ",{"v":0.15,"d":"15%"},{"v":0.05,"d":"5%"},{"$nulls":3},"Données INRAE et discussions COTEC COPIL"]
["Passage annuel d'une caméra IR ?","% d'abattement",{"v":-0.0333,"d":"-3.3%"},{"v":-0.015,"d":"-1.5%"},{"$nulls":3},"Données INRAE et discussions COTEC COPIL"]
["Passage hebdomadaire d'un renifleur de méthane ?",null,{"v":-0.01,"d":"-1.0%"},{"v":-0.01,"d":"-1.0%"},{"$nulls":3},"Données INRAE et discussions COTEC COPIL"]
["Utilisation d'un outil de pilotage pour la bonne gestion de l'alimentation du digesteur ?",null,{"v":-0.0333,"d":"-3.3%"},{"v":0,"d":"0.0%"},{"$nulls":3},"Données INRAE et discussions COTEC COPIL"]
["Maintenance et suivi quotidien des soupapes ?",null,{"v":-0.033,"d":"-3.3%"},{"v":0,"d":"0.0%"},{"$nulls":3},"Données INRAE et discussions COTEC COPIL"]
["Ronde journalière sur les éléments clés ?",null,{"v":-0.015,"d":"-1.5%"},{"v":-0.01,"d":"-1.0%"},{"$nulls":3},"Données INRAE et discussions COTEC COPIL"]
["Graissage annuel des passages de câbles ?",null,{"v":-0.015,"d":"-1.5%"},{"v":-0.01,"d":"-1.0%"},{"$nulls":3},"Données INRAE et discussions COTEC COPIL"]
[null,"Valeur minimale",{"$f":"SUM(C164:C170)","v":{"v":0.010399999999999993,"d":"1.0%"}},{"$f":"SUM(D164:D170)","v":{"v":5.000000000000001E-3,"d":"0.5%"}},{"$nulls":3},"Données INRAE et discussions COTEC COPIL"]
[]
["Consommation tracteur au bioGNV"]
[0.4,"L diesel/km",{"$nulls":5},"https://expertises.ademe.fr/professionnels/entreprises/performance-energetique-energies-renouvelables/lenergie-exploitations-agricoles/dossier/consommation-engins-agricoles/saviez"]
[{"$f":"A174*A138","v":0.3098039175257732},"kg biométhane/km"]
["Consommation camion au bioGNV"]
[{"$f":"A175/16","v":0.019362744845360824},"kg de biométhane/t.km","hypothèse camion 16 tonnes à plein"]

{"sheet":"BDD caractérisation substrats","index":22,"n_rows":87,"n_cols":72,"rows_kept":87,"hidden":true,"merged":[[1,21,1,22],[1,23,1,24],[1,25,1,27],[1,28,1,41],[1,42,1,59],[1,60,1,71]]}
[null,"A mettre a jour suivant les données de FGR - APIS - Méthasim, Sysmétha, ABIL2"]
[{"$nulls":21},"Stockage des effluents d'élevage",null,"Epandage des effluents d'élevage",null,"Substitution de fertilisant évité",null,null,"Stockage des effluents d'élevage",{"$nulls":13},"Epandage des effluents d'élevage",{"$nulls":17},"Substitution de fertilisant évité"]
["Catégories","Sous-catégories 1","Sous-catégories 2",null,null,"Rassemblement pour score azote","Pourcentagede matière sèche (% MS/MB)","Pourcentage de matière organique (% MO/MS)","Potentiel méthanogène (Nm3 CH4 / MO), (attention, il ne s'agit pas du potentiel biogaz)","Pourcentage de CH4 dans le biogaz issu du substrat (%vol de CH4)","Teneur en azote total \n(kg/t MB)","Teneur en azote ammoniacal NH4+\n(kg/t MB)","Teneur en phosphore (kg P2O5 / tMB)","Teneur en potassium (kg K2O / tMB)","Teneur en carbone organique total (kg COT/tMB)","Potentiel méthanogène (Nm3 CH4 / MS)","Potentiel méthanogène (Nm3 CH4 / MB)","Filière de référence","CC 20 ans (kg CO2éq/kg de déchets)","CC 100 ans (kg CO2éq/kg de déchets)","Ressources fossiles et nucléaires (MJ/kg de déchets)","Emission au stockage des effluents (kg eq CO2 20 ans)","Emission au stockage des effluents (kg eq CO2 100 ans)","Emission à l'épandage des effluents (kg eq CO2 20 ans)","Emission à l'épandage des effluents (kg eq CO2 100 ans)","substitution à l'épandage des effluents (kg eq CO2 20 ans)","substitution à l'épandage des effluents (kg eq CO2 100 ans)","substitution à l'épandage des effluents (kWh eq)","Taux d'expression du BMP","kg de CH4","N-NH3 / N-NH4","N-Nox / Ntot","N-N2O / Ntot","kg de N-NH3","kg de N-Nox","kg de N-N2O indirect","kg de N-N2O direct","kg eq CO2 20 ans","kg eq CO2 100 ans","Ntot sorti stockage","N-NH4+ sorti stockage","N-NH4+ sorti stockage avec minéralisation","N-NH3 / N-NH4","N-Nox / Ntot","N-N2O / (N-NH3 + N-Nox)","N-O3- / Ntot","N-N2O / (N-NO3-)","N-N2O / Ntot","kg de N-NH3","kg de N-Nox","kg de N-N2O indirect - NH3 et Nox","kg de N-NO3-","kg de N-N2O indirect - nitrate","kg de N-N2O direct","kg eq CO2 20 ans","kg eq CO2 100 ans","taux de minéralisation au sol","Norg épandage et minéralisé","N-NH4+ sorti stockage","N-pertes à l'épandage","N-MFE assimilable","kg eq CO2 20 ans","kg eq CO2 100 ans","Ressources fossiles et nucléaires (kWh eq)","P2O5-MFE assimilable","kg eq CO2 20 ans","kg eq CO2 100 ans","Ressources fossiles et nucléaires (kWh eq)","K2O-MFE assimilable","kg eq CO2 20 ans","kg eq CO2 100 ans","Ressources fossiles et nucléaires (kWh eq)"]
["Biomasse agricole animale","Effluents d'élevage","Volaille -  Lisier",null,null,"Lisier",0.10011428571428571,0.7605828467153273,537.8766068025363,0.7,5.323336286949997,2.1047573778840065,2.7074101213518174,2.822134961936777,{"$f":"G4*H4*0.45*1000","v":34.265343791449375},409.09972078345385,40.95672633214921,"Lisier",{"$nulls":3},{"$f":"AL4","v":853.0351804975265},288.11148382867856,{"$f":"BC4","v":22.751088893074158},22.751088893074158,{"$f":"-BJ4-BN4-BR4","v":-28.99489471127932},{"$f":"-BK4-BO4-BS4","v":-27.89676723815079},{"$f":"-BL4-BP4-BT4","v":-53.928316649562724},{"$f":"IF(R4=\"Lisier\",'BDD modélisation ICV'!$H$101,IF(R4=\"Fumier\",'BDD modélisation ICV'!$I$101,0))","v":{"v":0.36,"d":"0.360"}},{"$f":"Q4*AC4*massevol_CH4","v":{"v":10.525165985845488,"d":"10.53"}},{"$f":"IF(R4=\"Lisier\",'BDD modélisation ICV'!$H$102,IF(R4=\"Fumier\",'BDD modélisation ICV'!$I$102,0))","v":0.11},{"$f":"IF(R4=\"Lisier\",'BDD modélisation ICV'!$H$103,IF(R4=\"Fumier\",'BDD modélisation ICV'!$I$103,0))","v":1E-4},{"$f":"IF(R4=\"Lisier\",'BDD modélisation ICV'!$H$104,IF(R4=\"Fumier\",'BDD modélisation ICV'!$I$104,0))","v":0.0008},{"$f":"L4*AE4/18*14","v":0.18007368677452057},{"$f":"K4*AF4","v":5.3233362869499977E-4},{"$f":"(AH4+AI4)*0.01","v":1.8060602040321557E-3},{"$f":"K4*AG4","v":0.004258669029559998},{"$f":"AD4*FC_CH4B20+(AK4+AJ4)/28*44*FC_N2O20","v":853.0351804975265},{"$f":"AD4*FC_CH4B100+AK4/28*44*FC_N2O100","v":288.11148382867856},{"$f":"K4-AH4-AI4-AK4","v":5.1384715975172215},{"$f":"L4/18*14-AH4","v":1.4569598293574844},{"$f":"AO4+(AN4-AO4)*0.1","v":1.8251110061734581},{"$f":"IF(R4=\"Lisier\",'BDD modélisation ICV'!$H$107,IF(R4=\"Fumier\",'BDD modélisation ICV'!$I$107,0))","v":0.4},{"$f":"IF(R4=\"Lisier\",'BDD modélisation ICV'!$H$108,IF(R4=\"Fumier\",'BDD modélisation ICV'!$I$108,0))","v":0.026},{"$f":"IF(R4=\"Lisier\",'BDD modélisation ICV'!$H$110,IF(R4=\"Fumier\",'BDD modélisation ICV'!$I$110,0))","v":0.01},{"$f":"IF(R4=\"Lisier\",'BDD modélisation ICV'!$H$111,IF(R4=\"Fumier\",'BDD modélisation ICV'!$I$111,0))","v":0.24},{"$f":"IF(R4=\"Lisier\",'BDD modélisation ICV'!$H$112,IF(R4=\"Fumier\",'BDD modélisation ICV'!$I$112,0))","v":0.011},{"$f":"IF(R4=\"Lisier\",'BDD modélisation ICV'!$H$113,IF(R4=\"Fumier\",'BDD modélisation ICV'!$I$113,0))","v":0.006},{"$f":"AP4*AQ4","v":0.7300444024693833},{"$f":"AN4*AR4","v":0.13360026153544774},{"$f":"(AW4+AX4)*AS4","v":0.00863644664004831},{"$f":"AN4*AT4","v":1.233233183404133},{"$f":"AZ4*AU4","v":0.013565565017445462},{"$f":"AN4*AV4","v":0.03083082958510333},{"$f":"(BA4+AY4+BB4)/28*44*FC_N2O20","v":22.751088893074158},{"$f":"(BA4+AY4+BB4)/28*44*FC_N2O100","v":22.751088893074158},{"$f":"IF(R4=\"Lisier\",'BDD modélisation ICV'!$E$126,IF(R4=\"Fumier\",'BDD modélisation ICV'!$F$126,0))","v":0.67},{"$f":"(AN4-AP4)*BE4","v":2.2199515962003216},{"$f":"AP4","v":1.8251110061734581},{"$f":"AW4+AX4+AZ4+BB4","v":2.127708676994067},{"$f":"BF4+BG4-BH4","v":1.9173539253797127},{"$f":"BI4*'BDD export Ecoinvent - SIMAPRO'!$D$60","v":23.831862035262617},{"$f":"BI4*'BDD export Ecoinvent - SIMAPRO'!$D$61","v":23.189857992697274},{"$f":"BI4*'BDD export Ecoinvent - SIMAPRO'!$D$62","v":33.62476720962836},{"$f":"M4*0.95","v":2.5720396152842264},{"$f":"BM4*'BDD export Ecoinvent - SIMAPRO'!$E$60","v":2.752339592315651},{"$f":"BM4*'BDD export Ecoinvent - SIMAPRO'!$E$61","v":2.5119824902673398},{"$f":"BM4*'BDD export Ecoinvent - SIMAPRO'!$E$62","v":11.288396089302994},{"$f":"N4","v":2.822134961936777},{"$f":"BQ4*'BDD export Ecoinvent - SIMAPRO'!$F$60","v":2.4106930837010525},{"$f":"BQ4*'BDD export Ecoinvent - SIMAPRO'!$F$61","v":2.194926755186176},{"$f":"BQ4*'BDD export Ecoinvent - SIMAPRO'!$F$62","v":9.01515335063137}]
["Biomasse agricole animale","Effluents d'élevage","Volaille -  Fumier (terre battue)",null,null,"Fumier",0.5575,0.8334999999999999,247.8,0.65,14.076019215109739,1.0897407151464775,9.433074097873707,7.857142856249449,{"$f":"G5*H5*0.45*1000","v":209.10431249999996},206.54129999999998,115.14677474999999,"Fumier",{"$nulls":3},222.16174069133706,154.3083913202347,56.67225271361081,56.67225271361081,{"$f":"-BJ5-BN5-BR5","v":-73.96399825134114},-70.9724651235499,-145.78719585486726,{"$f":"IF(R5=\"Lisier\",'BDD modélisation ICV'!$H$101,IF(R5=\"Fumier\",'BDD modélisation ICV'!$I$101,0))","v":0.015},{"v":1.23294656083063,"d":"1.23"},{"$f":"IF(R5=\"Lisier\",'BDD modélisation ICV'!$H$102,IF(R5=\"Fumier\",'BDD modélisation ICV'!$I$102,0))","v":0.32},{"$f":"IF(R5=\"Lisier\",'BDD modélisation ICV'!$H$103,IF(R5=\"Fumier\",'BDD modélisation ICV'!$I$103,0))","v":0.01},{"$f":"IF(R5=\"Lisier\",'BDD modélisation ICV'!$H$104,IF(R5=\"Fumier\",'BDD modélisation ICV'!$I$104,0))","v":0.02},{"$f":"L5*AE5/18*14","v":0.27122435576979},{"$f":"K5*AF5","v":0.1407601921510974},{"$f":"(AH5+AI5)*0.01","v":4.1198454792088736E-3},{"$f":"K5*AG5","v":0.2815203843021948},222.16174069133706,154.3083913202347,{"$f":"K5-AH5-AI5-AK5","v":13.382514282886657},{"$f":"L5/18*14-AH5","v":0.5763517560108036},{"$f":"AO5+(AN5-AO5)*0.1","v":1.856968008698389},{"$f":"IF(R5=\"Lisier\",'BDD modélisation ICV'!$H$107,IF(R5=\"Fumier\",'BDD modélisation ICV'!$I$107,0))","v":0.7},{"$f":"IF(R5=\"Lisier\",'BDD modélisation ICV'!$H$108,IF(R5=\"Fumier\",'BDD modélisation ICV'!$I$108,0))","v":0.026},{"$f":"IF(R5=\"Lisier\",'BDD modélisation ICV'!$H$110,IF(R5=\"Fumier\",'BDD modélisation ICV'!$I$110,0))","v":0.01},{"$f":"IF(R5=\"Lisier\",'BDD modélisation ICV'!$H$111,IF(R5=\"Fumier\",'BDD modélisation ICV'!$I$111,0))","v":0.24},{"$f":"IF(R5=\"Lisier\",'BDD modélisation ICV'!$H$112,IF(R5=\"Fumier\",'BDD modélisation ICV'!$I$112,0))","v":0.011},{"$f":"IF(R5=\"Lisier\",'BDD modélisation ICV'!$H$113,IF(R5=\"Fumier\",'BDD modélisation ICV'!$I$113,0))","v":0.006},1.2998776060888724,0.34794537135505305,0.016478229774439256,3.2118034278927974,0.03532983770682077,0.08029508569731994,{"$f":"(BA5+AY5+BB5)/28*44*FC_N2O20","v":56.67225271361081},56.67225271361081,{"$f":"IF(R5=\"Lisier\",'BDD modélisation ICV'!$E$126,IF(R5=\"Fumier\",'BDD modélisation ICV'!$F$126,0))","v":0.67},7.722116003706139,1.856968008698389,{"$f":"AW5+AX5+AZ5+BB5","v":4.939921491034043},{"$f":"BF5+BG5-BH5","v":4.639162521370486},{"$f":"BI5*'BDD export Ecoinvent - SIMAPRO'!$D$60","v":57.66274014671924},{"$f":"BI5*'BDD export Ecoinvent - SIMAPRO'!$D$61","v":56.109369611726514},{"$f":"BI5*'BDD export Ecoinvent - SIMAPRO'!$D$62","v":81.35731111710255},{"$f":"M5*0.95","v":8.96142039298002},{"$f":"BM5*'BDD export Ecoinvent - SIMAPRO'!$E$60","v":9.58961596252792},{"$f":"BM5*'BDD export Ecoinvent - SIMAPRO'!$E$61","v":8.752171226803938},{"$f":"BM5*'BDD export Ecoinvent - SIMAPRO'!$E$62","v":39.33067839141231},{"$f":"N5","v":7.857142856249449},{"$f":"BQ5*'BDD export Ecoinvent - SIMAPRO'!$F$60","v":6.711642142093985},{"$f":"BQ5*'BDD export Ecoinvent - SIMAPRO'!$F$61","v":6.110924285019434},{"$f":"BQ5*'BDD export Ecoinvent - SIMAPRO'!$F$62","v":25.099206346352403}]
["Biomasse agricole animale","Effluents d'élevage","Volaille -  Fumier (autres), fientes",null,null,"Fumier",0.48740215517241375,0.7584398282367806,228.78967702032034,0.65,22.68443600246388,2.758121535327542,12.636925656252252,16.53646267113552,166.349343083041,173.52320334164025,84.57558328113645,"Fumier",{"$nulls":3},271.7232206698782,219.2648412136319,91.73626917694342,91.73626917694342,-116.58728675905017,-111.78698620100535,-231.9531314462994,{"$f":"IF(R6=\"Lisier\",'BDD modélisation ICV'!$H$101,IF(R6=\"Fumier\",'BDD modélisation ICV'!$I$101,0))","v":0.015},{"v":0.905602217371023,"d":"0.91"},{"$f":"IF(R6=\"Lisier\",'BDD modélisation ICV'!$H$102,IF(R6=\"Fumier\",'BDD modélisation ICV'!$I$102,0))","v":0.32},{"$f":"IF(R6=\"Lisier\",'BDD modélisation ICV'!$H$103,IF(R6=\"Fumier\",'BDD modélisation ICV'!$I$103,0))","v":0.01},{"$f":"IF(R6=\"Lisier\",'BDD modélisation ICV'!$H$104,IF(R6=\"Fumier\",'BDD modélisation ICV'!$I$104,0))","v":0.02},0.6864658043481883,0.2268443600246388,0.009133101643728271,0.4536887200492776,271.7232206698782,219.2648412136319,21.317437118041774,1.4587398342399003,3.4446095626200877,{"$f":"IF(R6=\"Lisier\",'BDD modélisation ICV'!$H$107,IF(R6=\"Fumier\",'BDD modélisation ICV'!$I$107,0))","v":0.7},{"$f":"IF(R6=\"Lisier\",'BDD modélisation ICV'!$H$108,IF(R6=\"Fumier\",'BDD modélisation ICV'!$I$108,0))","v":0.026},{"$f":"IF(R6=\"Lisier\",'BDD modélisation ICV'!$H$110,IF(R6=\"Fumier\",'BDD modélisation ICV'!$I$110,0))","v":0.01},{"$f":"IF(R6=\"Lisier\",'BDD modélisation ICV'!$H$111,IF(R6=\"Fumier\",'BDD modélisation ICV'!$I$111,0))","v":0.24},{"$f":"IF(R6=\"Lisier\",'BDD modélisation ICV'!$H$112,IF(R6=\"Fumier\",'BDD modélisation ICV'!$I$112,0))","v":0.011},{"$f":"IF(R6=\"Lisier\",'BDD modélisation ICV'!$H$113,IF(R6=\"Fumier\",'BDD modélisation ICV'!$I$113,0))","v":0.006},2.4112266938340614,0.5542533650690861,0.029654800589031475,5.116184908330026,0.05627803399163028,0.12790462270825065,91.73626917694342,91.73626917694342,{"$f":"IF(R6=\"Lisier\",'BDD modélisation ICV'!$E$126,IF(R6=\"Fumier\",'BDD modélisation ICV'!$F$126,0))","v":0.67},11.97479446213253,3.4446095626200877,8.209569589941424,7.209834434811194,{"$f":"BI6*'BDD export Ecoinvent - SIMAPRO'!$D$60","v":89.61505607968441},{"$f":"BI6*'BDD export Ecoinvent - SIMAPRO'!$D$61","v":87.20092544260919},{"$f":"BI6*'BDD export Ecoinvent - SIMAPRO'!$D$62","v":126.43936066340919},12.005079373439639,{"$f":"BM6*'BDD export Ecoinvent - SIMAPRO'!$E$60","v":12.846635437517758},{"$f":"BM6*'BDD export Ecoinvent - SIMAPRO'!$E$61","v":11.724760770069823},{"$f":"BM6*'BDD export Ecoinvent - SIMAPRO'!$E$62","v":52.688959472318416},16.53646267113552,{"$f":"BQ6*'BDD export Ecoinvent - SIMAPRO'!$F$60","v":14.125595241848002},{"$f":"BQ6*'BDD export Ecoinvent - SIMAPRO'!$F$61","v":12.861299988326335},{"$f":"BQ6*'BDD export Ecoinvent - SIMAPRO'!$F$62","v":52.824811310571796}]
["Biomasse agricole animale","Effluents d'élevage","Cunicole - Lisier, crottes",null,null,"Lisier",0.1885,0.8005000000000001,166.1397645,0.6,8.3,2.45,5.199999999999999,7.449999999999999,67.90241250000001,132.99488148225004,25.069535159404133,"Lisier",{"$nulls":3},524.3000442066875,178.0827730946605,34.867638091,34.867638091,-49.60476115310282,-47.55107312520096,-99.03050761031739,{"$f":"IF(R7=\"Lisier\",'BDD modélisation ICV'!$H$101,IF(R7=\"Fumier\",'BDD modélisation ICV'!$I$101,0))","v":{"v":0.36,"d":"0.360"}},{"v":6.442434304950754,"d":"6.44"},{"$f":"IF(R7=\"Lisier\",'BDD modélisation ICV'!$H$102,IF(R7=\"Fumier\",'BDD modélisation ICV'!$I$102,0))","v":0.11},{"$f":"IF(R7=\"Lisier\",'BDD modélisation ICV'!$H$103,IF(R7=\"Fumier\",'BDD modélisation ICV'!$I$103,0))","v":1E-4},{"$f":"IF(R7=\"Lisier\",'BDD modélisation ICV'!$H$104,IF(R7=\"Fumier\",'BDD modélisation ICV'!$I$104,0))","v":0.0008},0.20961111111111114,8.3000000000000012E-4,2.1044111111111112E-3,0.006640000000000001,524.3000442066875,178.0827730946605,8.082918888888889,1.6959444444444447,2.334641888888889,{"$f":"IF(R7=\"Lisier\",'BDD modélisation ICV'!$H$107,IF(R7=\"Fumier\",'BDD modélisation ICV'!$I$107,0))","v":0.4},{"$f":"IF(R7=\"Lisier\",'BDD modélisation ICV'!$H$108,IF(R7=\"Fumier\",'BDD modélisation ICV'!$I$108,0))","v":0.026},{"$f":"IF(R7=\"Lisier\",'BDD modélisation ICV'!$H$110,IF(R7=\"Fumier\",'BDD modélisation ICV'!$I$110,0))","v":0.01},{"$f":"IF(R7=\"Lisier\",'BDD modélisation ICV'!$H$111,IF(R7=\"Fumier\",'BDD modélisation ICV'!$I$111,0))","v":0.24},{"$f":"IF(R7=\"Lisier\",'BDD modélisation ICV'!$H$112,IF(R7=\"Fumier\",'BDD modélisation ICV'!$I$112,0))","v":0.011},{"$f":"IF(R7=\"Lisier\",'BDD modélisation ICV'!$H$113,IF(R7=\"Fumier\",'BDD modélisation ICV'!$I$113,0))","v":0.006},0.9338567555555557,0.2101558911111111,0.011440126466666669,1.9399005333333332,0.021338905866666664,0.04849751333333333,34.867638091,34.867638091,{"$f":"IF(R7=\"Lisier\",'BDD modélisation ICV'!$E$126,IF(R7=\"Fumier\",'BDD modélisation ICV'!$F$126,0))","v":0.67},3.85134559,2.334641888888889,3.1324106933333336,3.053576785555556,{"$f":"BI7*'BDD export Ecoinvent - SIMAPRO'!$D$60","v":37.95461010310282},{"$f":"BI7*'BDD export Ecoinvent - SIMAPRO'!$D$61","v":36.93215482520096},{"$f":"BI7*'BDD export Ecoinvent - SIMAPRO'!$D$62","v":53.55078538809516},4.9399999999999995,{"$f":"BM7*'BDD export Ecoinvent - SIMAPRO'!$E$60","v":5.286294},{"$f":"BM7*'BDD export Ecoinvent - SIMAPRO'!$E$61","v":4.824650999999999},{"$f":"BM7*'BDD export Ecoinvent - SIMAPRO'!$E$62","v":21.68111111111111},7.449999999999999,{"$f":"BQ7*'BDD export Ecoinvent - SIMAPRO'!$F$60","v":6.363857049999999},{"$f":"BQ7*'BDD export Ecoinvent - SIMAPRO'!$F$61","v":5.794267299999999},{"$f":"BQ7*'BDD export Ecoinvent - SIMAPRO'!$F$62","v":23.798611111111107}]
["Biomasse agricole animale","Effluents d'élevage","Caprin - Fumiers autres",null,null,"Fumier",0.3613,0.8139765223771093,155.5972464878572,0.6,13.73730127615704,1.0690392976516172,3.6833694552646747,17.736669282591762,132.34037289068232,126.6525055876399,45.759550268814294,"Fumier",{"$nulls":3},159.18683155369587,131.19337420240132,55.310754296580896,55.310754296580896,-75.15223823724135,-71.95368154276281,-151.39022628694696,{"$f":"IF(R8=\"Lisier\",'BDD modélisation ICV'!$H$101,IF(R8=\"Fumier\",'BDD modélisation ICV'!$I$101,0))","v":0.015},{"v":0.4899753401828644,"d":"0.49"},{"$f":"IF(R8=\"Lisier\",'BDD modélisation ICV'!$H$102,IF(R8=\"Fumier\",'BDD modélisation ICV'!$I$102,0))","v":0.32},{"$f":"IF(R8=\"Lisier\",'BDD modélisation ICV'!$H$103,IF(R8=\"Fumier\",'BDD modélisation ICV'!$I$103,0))","v":0.01},{"$f":"IF(R8=\"Lisier\",'BDD modélisation ICV'!$H$104,IF(R8=\"Fumier\",'BDD modélisation ICV'!$I$104,0))","v":0.02},0.2660720029710692,0.1373730127615704,4.034450157326396E-3,0.2747460255231408,159.18683155369587,131.19337420240132,13.05911023490126,0.5654030063135218,1.8147737291722956,{"$f":"IF(R8=\"Lisier\",'BDD modélisation ICV'!$H$107,IF(R8=\"Fumier\",'BDD modélisation ICV'!$I$107,0))","v":0.7},{"$f":"IF(R8=\"Lisier\",'BDD modélisation ICV'!$H$108,IF(R8=\"Fumier\",'BDD modélisation ICV'!$I$108,0))","v":0.026},{"$f":"IF(R8=\"Lisier\",'BDD modélisation ICV'!$H$110,IF(R8=\"Fumier\",'BDD modélisation ICV'!$I$110,0))","v":0.01},{"$f":"IF(R8=\"Lisier\",'BDD modélisation ICV'!$H$111,IF(R8=\"Fumier\",'BDD modélisation ICV'!$I$111,0))","v":0.24},{"$f":"IF(R8=\"Lisier\",'BDD modélisation ICV'!$H$112,IF(R8=\"Fumier\",'BDD modélisation ICV'!$I$112,0))","v":0.011},{"$f":"IF(R8=\"Lisier\",'BDD modélisation ICV'!$H$113,IF(R8=\"Fumier\",'BDD modélisation ICV'!$I$113,0))","v":0.006},1.270341610420607,0.3395368661074327,0.016098784765280396,3.134186456376302,0.03447605102013932,0.07835466140940756,55.310754296580896,55.310754296580896,{"$f":"IF(R8=\"Lisier\",'BDD modélisation ICV'!$E$126,IF(R8=\"Fumier\",'BDD modélisation ICV'!$F$126,0))","v":0.67},7.533705458838406,1.8147737291722956,4.822419594313749,4.526059593696952,{"$f":"BI8*'BDD export Ecoinvent - SIMAPRO'!$D$60","v":56.256920734653136},{"$f":"BI8*'BDD export Ecoinvent - SIMAPRO'!$D$61","v":54.741421421989905},{"$f":"BI8*'BDD export Ecoinvent - SIMAPRO'!$D$62","v":79.37381732213362},3.4992009825014407,{"$f":"BM8*'BDD export Ecoinvent - SIMAPRO'!$E$60","v":3.7444949713747917},{"$f":"BM8*'BDD export Ecoinvent - SIMAPRO'!$E$61","v":3.417494639560032},{"$f":"BM8*'BDD export Ecoinvent - SIMAPRO'!$E$62","v":15.357604312089657},17.736669282591762,{"$f":"BQ8*'BDD export Ecoinvent - SIMAPRO'!$F$60","v":15.150822531213427},{"$f":"BQ8*'BDD export Ecoinvent - SIMAPRO'!$F$61","v":13.794765481212872},{"$f":"BQ8*'BDD export Ecoinvent - SIMAPRO'!$F$62","v":56.65880465272368}]
["Biomasse agricole animale","Effluents d'élevage","Ovin - Fumier accumulé",null,null,"Fumier",0.3,0.8,247.5,0.6,6.7,0.5787037037037036,4,12,108,198,59.4,"Fumier",{"$nulls":3},109.78271141421834,74.78606857532789,26.99951169259259,26.99951169259259,-41.56523649105215,-39.55862607664388,-93.456255410066,{"$f":"IF(R9=\"Lisier\",'BDD modélisation ICV'!$H$101,IF(R9=\"Fumier\",'BDD modélisation ICV'!$I$101,0))","v":0.015},{"v":0.636031932916466,"d":"0.64"},{"$f":"IF(R9=\"Lisier\",'BDD modélisation ICV'!$H$102,IF(R9=\"Fumier\",'BDD modélisation ICV'!$I$102,0))","v":0.32},{"$f":"IF(R9=\"Lisier\",'BDD modélisation ICV'!$H$103,IF(R9=\"Fumier\",'BDD modélisation ICV'!$I$103,0))","v":0.01},{"$f":"IF(R9=\"Lisier\",'BDD modélisation ICV'!$H$104,IF(R9=\"Fumier\",'BDD modélisation ICV'!$I$104,0))","v":0.02},0.14403292181069957,0.067,2.1103292181069958E-3,0.134,109.78271141421834,74.78606857532789,6.3549670781893,0.3060699588477366,0.910959670781893,{"$f":"IF(R9=\"Lisier\",'BDD modélisation ICV'!$H$107,IF(R9=\"Fumier\",'BDD modélisation ICV'!$I$107,0))","v":0.7},{"$f":"IF(R9=\"Lisier\",'BDD modélisation ICV'!$H$108,IF(R9=\"Fumier\",'BDD modélisation ICV'!$I$108,0))","v":0.026},{"$f":"IF(R9=\"Lisier\",'BDD modélisation ICV'!$H$110,IF(R9=\"Fumier\",'BDD modélisation ICV'!$I$110,0))","v":0.01},{"$f":"IF(R9=\"Lisier\",'BDD modélisation ICV'!$H$111,IF(R9=\"Fumier\",'BDD modélisation ICV'!$I$111,0))","v":0.24},{"$f":"IF(R9=\"Lisier\",'BDD modélisation ICV'!$H$112,IF(R9=\"Fumier\",'BDD modélisation ICV'!$I$112,0))","v":0.011},{"$f":"IF(R9=\"Lisier\",'BDD modélisation ICV'!$H$113,IF(R9=\"Fumier\",'BDD modélisation ICV'!$I$113,0))","v":0.006},0.6376717695473251,0.1652291440329218,0.008029009135802468,1.525192098765432,0.01677711308641975,0.0381298024691358,26.99951169259259,26.99951169259259,{"$f":"IF(R9=\"Lisier\",'BDD modélisation ICV'!$E$126,IF(R9=\"Fumier\",'BDD modélisation ICV'!$F$126,0))","v":0.67},3.6474849629629627,0.910959670781893,2.3662228148148143,2.192221818930041,{"$f":"BI9*'BDD export Ecoinvent - SIMAPRO'!$D$60","v":27.248348491052145},{"$f":"BI9*'BDD export Ecoinvent - SIMAPRO'!$D$61","v":26.514308076643882},{"$f":"BI9*'BDD export Ecoinvent - SIMAPRO'!$D$62","v":38.44514429895491},3.8,{"$f":"BM9*'BDD export Ecoinvent - SIMAPRO'!$E$60","v":4.06638},{"$f":"BM9*'BDD export Ecoinvent - SIMAPRO'!$E$61","v":3.71127},{"$f":"BM9*'BDD export Ecoinvent - SIMAPRO'!$E$62","v":16.677777777777777},12,{"$f":"BQ9*'BDD export Ecoinvent - SIMAPRO'!$F$60","v":10.250508},{"$f":"BQ9*'BDD export Ecoinvent - SIMAPRO'!$F$61","v":9.333048},{"$f":"BQ9*'BDD export Ecoinvent - SIMAPRO'!$F$62","v":38.33333333333333}]
["Biomasse agricole animale","Effluents d'élevage","Ovin - Fumiers autres",null,null,"Fumier",0.38069000000000003,0.8131280939871571,186.42337123119967,0.6,12.6808,0.669372,4.9852,21.8768,139.2973803449869,151.5860805238856,57.707304994638015,"Fumier",{"$nulls":3},159.9868843175152,125.60834032499324,50.928565232688,50.928565232688,-76.73508219553413,-73.192700738241,-165.41980091189095,{"$f":"IF(R10=\"Lisier\",'BDD modélisation ICV'!$H$101,IF(R10=\"Fumier\",'BDD modélisation ICV'!$I$101,0))","v":0.015},{"v":0.6179072178306338,"d":"0.62"},{"$f":"IF(R10=\"Lisier\",'BDD modélisation ICV'!$H$102,IF(R10=\"Fumier\",'BDD modélisation ICV'!$I$102,0))","v":0.32},{"$f":"IF(R10=\"Lisier\",'BDD modélisation ICV'!$H$103,IF(R10=\"Fumier\",'BDD modélisation ICV'!$I$103,0))","v":0.01},{"$f":"IF(R10=\"Lisier\",'BDD modélisation ICV'!$H$104,IF(R10=\"Fumier\",'BDD modélisation ICV'!$I$104,0))","v":0.02},0.16659925333333336,0.126808,0.002934072533333334,0.253616,159.9868843175152,125.60834032499324,12.133776746666667,0.3540234133333332,1.5319987466666665,{"$f":"IF(R10=\"Lisier\",'BDD modélisation ICV'!$H$107,IF(R10=\"Fumier\",'BDD modélisation ICV'!$I$107,0))","v":0.7},{"$f":"IF(R10=\"Lisier\",'BDD modélisation ICV'!$H$108,IF(R10=\"Fumier\",'BDD modélisation ICV'!$I$108,0))","v":0.026},{"$f":"IF(R10=\"Lisier\",'BDD modélisation ICV'!$H$110,IF(R10=\"Fumier\",'BDD modélisation ICV'!$I$110,0))","v":0.01},{"$f":"IF(R10=\"Lisier\",'BDD modélisation ICV'!$H$111,IF(R10=\"Fumier\",'BDD modélisation ICV'!$I$111,0))","v":0.24},{"$f":"IF(R10=\"Lisier\",'BDD modélisation ICV'!$H$112,IF(R10=\"Fumier\",'BDD modélisation ICV'!$I$112,0))","v":0.011},{"$f":"IF(R10=\"Lisier\",'BDD modélisation ICV'!$H$113,IF(R10=\"Fumier\",'BDD modélisation ICV'!$I$113,0))","v":0.006},1.0723991226666665,0.31547819541333333,0.013878773180799997,2.9121064192,0.0320331706112,0.07280266048,50.928565232688,50.928565232688,{"$f":"IF(R10=\"Lisier\",'BDD modélisation ICV'!$E$126,IF(R10=\"Fumier\",'BDD modélisation ICV'!$F$126,0))","v":0.67},7.103191260000001,1.5319987466666665,4.37278639776,4.262403608906667,{"$f":"BI10*'BDD export Ecoinvent - SIMAPRO'!$D$60","v":52.97979335033414},{"$f":"BI10*'BDD export Ecoinvent - SIMAPRO'!$D$61","v":51.552576230041},{"$f":"BI10*'BDD export Ecoinvent - SIMAPRO'!$D$62","v":74.75006424522428},4.735939999999999,{"$f":"BM10*'BDD export Ecoinvent - SIMAPRO'!$E$60","v":5.067929393999999},{"$f":"BM10*'BDD export Ecoinvent - SIMAPRO'!$E$61","v":4.6253558009999995},{"$f":"BM10*'BDD export Ecoinvent - SIMAPRO'!$E$62","v":20.785514444444445},21.8768,{"$f":"BQ10*'BDD export Ecoinvent - SIMAPRO'!$F$60","v":18.6873594512},{"$f":"BQ10*'BDD export Ecoinvent - SIMAPRO'!$F$61","v":17.0147687072},{"$f":"BQ10*'BDD export Ecoinvent - SIMAPRO'!$F$62","v":69.88422222222222}]
["Biomasse agricole animale","Effluents d'élevage","Equin - Fumier",null,null,"Fumier",0.5905,0.8278500000000001,152.69113290375,0.68,5.822073147440794,0.29110365737203975,2.618976883682766,8.920282128002716,219.98044125,126.40535437436945,74.64236175806516,"Fumier",{"$nulls":3},115.09266233220109,71.69274748785276,23.376020752363445,23.376020752363445,-34.66020252197633,-33.08898031621109,-73.81031615765224,{"$f":"IF(R11=\"Lisier\",'BDD modélisation ICV'!$H$101,IF(R11=\"Fumier\",'BDD modélisation ICV'!$I$101,0))","v":0.015},{"v":0.7992411721621597,"d":"0.80"},{"$f":"IF(R11=\"Lisier\",'BDD modélisation ICV'!$H$102,IF(R11=\"Fumier\",'BDD modélisation ICV'!$I$102,0))","v":0.32},{"$f":"IF(R11=\"Lisier\",'BDD modélisation ICV'!$H$103,IF(R11=\"Fumier\",'BDD modélisation ICV'!$I$103,0))","v":0.01},{"$f":"IF(R11=\"Lisier\",'BDD modélisation ICV'!$H$104,IF(R11=\"Fumier\",'BDD modélisation ICV'!$I$104,0))","v":0.02},0.07245246583481878,0.05822073147440794,1.3067319730922671E-3,0.11644146294881588,115.09266233220109,71.69274748785276,5.5749584871827516,0.1539614898989899,0.6960611896273661,{"$f":"IF(R11=\"Lisier\",'BDD modélisation ICV'!$H$107,IF(R11=\"Fumier\",'BDD modélisation ICV'!$I$107,0))","v":0.7},{"$f":"IF(R11=\"Lisier\",'BDD modélisation ICV'!$H$108,IF(R11=\"Fumier\",'BDD modélisation ICV'!$I$108,0))","v":0.026},{"$f":"IF(R11=\"Lisier\",'BDD modélisation ICV'!$H$110,IF(R11=\"Fumier\",'BDD modélisation ICV'!$I$110,0))","v":0.01},{"$f":"IF(R11=\"Lisier\",'BDD modélisation ICV'!$H$111,IF(R11=\"Fumier\",'BDD modélisation ICV'!$I$111,0))","v":0.24},{"$f":"IF(R11=\"Lisier\",'BDD modélisation ICV'!$H$112,IF(R11=\"Fumier\",'BDD modélisation ICV'!$I$112,0))","v":0.011},{"$f":"IF(R11=\"Lisier\",'BDD modélisation ICV'!$H$113,IF(R11=\"Fumier\",'BDD modélisation ICV'!$I$113,0))","v":0.006},0.4872428327391562,0.14494892066675152,0.006321917534059077,1.3379900369238604,0.014717890406162464,0.03344975092309651,23.376020752363445,23.376020752363445,{"$f":"IF(R11=\"Lisier\",'BDD modélisation ICV'!$E$126,IF(R11=\"Fumier\",'BDD modélisation ICV'!$F$126,0))","v":0.67},3.268861189362108,0.6960611896273661,2.0036315412528647,1.9612908377366094,{"$f":"BI11*'BDD export Ecoinvent - SIMAPRO'!$D$60","v":24.37797844062978},{"$f":"BI11*'BDD export Ecoinvent - SIMAPRO'!$D$61","v":23.72126262525213},{"$f":"BI11*'BDD export Ecoinvent - SIMAPRO'!$D$62","v":34.39529185317736},2.488028039498628,{"$f":"BM11*'BDD export Ecoinvent - SIMAPRO'!$E$60","v":2.662438805067482},{"$f":"BM11*'BDD export Ecoinvent - SIMAPRO'!$E$61","v":2.429932584776335},{"$f":"BM11*'BDD export Ecoinvent - SIMAPRO'!$E$62","v":10.919678617799534},8.920282128002716,{"$f":"BQ11*'BDD export Ecoinvent - SIMAPRO'!$F$60","v":7.619785276279072},{"$f":"BQ11*'BDD export Ecoinvent - SIMAPRO'!$F$61","v":6.937785106182624},{"$f":"BQ11*'BDD export Ecoinvent - SIMAPRO'!$F$62","v":28.495345686675343}]
["Biomasse agricole animale","Effluents d'élevage","Porcin - Fumier frais",null,null,"Fumier",0.22362500000000002,0.7884403719417472,229.91198285693724,0.6,7.319964618750801,0.966205696097708,6.3146561841504125,9.902632959441801,79.34174017896295,181.2718892775882,40.53692623970066,"Fumier",{"$nulls":3},99.22249798504245,74.61155238477126,29.6328834656121,29.6328834656121,-43.54405133868211,-41.45412424537358,-98.40690707921047,{"$f":"IF(R12=\"Lisier\",'BDD modélisation ICV'!$H$101,IF(R12=\"Fumier\",'BDD modélisation ICV'!$I$101,0))","v":0.015},{"v":0.43405352779005085,"d":"0.43"},{"$f":"IF(R12=\"Lisier\",'BDD modélisation ICV'!$H$102,IF(R12=\"Fumier\",'BDD modélisation ICV'!$I$102,0))","v":0.32},{"$f":"IF(R12=\"Lisier\",'BDD modélisation ICV'!$H$103,IF(R12=\"Fumier\",'BDD modélisation ICV'!$I$103,0))","v":0.01},{"$f":"IF(R12=\"Lisier\",'BDD modélisation ICV'!$H$104,IF(R12=\"Fumier\",'BDD modélisation ICV'!$I$104,0))","v":0.02},0.24047786213987396,0.07319964618750802,3.1367750832738198E-3,0.14639929237501603,99.22249798504245,74.61155238477126,6.859887818048404,0.5110154570472322,1.1459026931473493,{"$f":"IF(R12=\"Lisier\",'BDD modélisation ICV'!$H$107,IF(R12=\"Fumier\",'BDD modélisation ICV'!$I$107,0))","v":0.7},{"$f":"IF(R12=\"Lisier\",'BDD modélisation ICV'!$H$108,IF(R12=\"Fumier\",'BDD modélisation ICV'!$I$108,0))","v":0.026},{"$f":"IF(R12=\"Lisier\",'BDD modélisation ICV'!$H$110,IF(R12=\"Fumier\",'BDD modélisation ICV'!$I$110,0))","v":0.01},{"$f":"IF(R12=\"Lisier\",'BDD modélisation ICV'!$H$111,IF(R12=\"Fumier\",'BDD modélisation ICV'!$I$111,0))","v":0.24},{"$f":"IF(R12=\"Lisier\",'BDD modélisation ICV'!$H$112,IF(R12=\"Fumier\",'BDD modélisation ICV'!$I$112,0))","v":0.011},{"$f":"IF(R12=\"Lisier\",'BDD modélisation ICV'!$H$113,IF(R12=\"Fumier\",'BDD modélisation ICV'!$I$113,0))","v":0.006},0.8021318852031445,0.17835708326925848,0.00980488968472403,1.646373076331617,0.018110103839647784,0.041159326908290425,29.6328834656121,29.6328834656121,{"$f":"IF(R12=\"Lisier\",'BDD modélisation ICV'!$E$126,IF(R12=\"Fumier\",'BDD modélisation ICV'!$F$126,0))","v":0.67},3.8283700336837065,1.1459026931473493,2.6680213717123107,2.306251355118745,{"$f":"BI12*'BDD export Ecoinvent - SIMAPRO'!$D$60","v":28.6656852375039},{"$f":"BI12*'BDD export Ecoinvent - SIMAPRO'!$D$61","v":27.893463336497902},{"$f":"BI12*'BDD export Ecoinvent - SIMAPRO'!$D$62","v":40.444888090966465},5.998923374942891,{"$f":"BM12*'BDD export Ecoinvent - SIMAPRO'!$E$60","v":6.419447903526389},{"$f":"BM12*'BDD export Ecoinvent - SIMAPRO'!$E$61","v":5.858848514137975},{"$f":"BM12*'BDD export Ecoinvent - SIMAPRO'!$E$62","v":26.32860814558269},9.902632959441801,{"$f":"BQ12*'BDD export Ecoinvent - SIMAPRO'!$F$60","v":8.45891819765182},{"$f":"BQ12*'BDD export Ecoinvent - SIMAPRO'!$F$61","v":7.701812394737698},{"$f":"BQ12*'BDD export Ecoinvent - SIMAPRO'!$F$62","v":31.633410842661306}]
["Biomasse agricole animale","Effluents d'élevage","Porcin - Autres",null,null,"Lisier",0.06,0.7273333333333334,127.46666666666667,0.76,4.095626466551077,1.7064908769440368,2.3978096969918457,3.0063659602202755,19.637999999999998,92.71075555555556,5.562645333333334,"Lisier",{"$nulls":3},117.53756198311058,40.28810212529782,17.56747411118245,17.56747411118245,-23.25776030937814,-22.323345792654003,-45.353383960922926,{"$f":"IF(R13=\"Lisier\",'BDD modélisation ICV'!$H$101,IF(R13=\"Fumier\",'BDD modélisation ICV'!$I$101,0))","v":{"v":0.36,"d":"0.360"}},{"v":1.4295030559550546,"d":"1.43"},{"$f":"IF(R13=\"Lisier\",'BDD modélisation ICV'!$H$102,IF(R13=\"Fumier\",'BDD modélisation ICV'!$I$102,0))","v":0.11},{"$f":"IF(R13=\"Lisier\",'BDD modélisation ICV'!$H$103,IF(R13=\"Fumier\",'BDD modélisation ICV'!$I$103,0))","v":1E-4},{"$f":"IF(R13=\"Lisier\",'BDD modélisation ICV'!$H$104,IF(R13=\"Fumier\",'BDD modélisation ICV'!$I$104,0))","v":0.0008},0.14599977502743425,4.0956264665510775E-4,1.4640933767408938E-3,3.276501173240862E-3,117.53756198311058,40.28810212529782,3.945940627703747,1.18127090704015,1.4577378791065096,{"$f":"IF(R13=\"Lisier\",'BDD modélisation ICV'!$H$107,IF(R13=\"Fumier\",'BDD modélisation ICV'!$I$107,0))","v":0.4},{"$f":"IF(R13=\"Lisier\",'BDD modélisation ICV'!$H$108,IF(R13=\"Fumier\",'BDD modélisation ICV'!$I$108,0))","v":0.026},{"$f":"IF(R13=\"Lisier\",'BDD modélisation ICV'!$H$110,IF(R13=\"Fumier\",'BDD modélisation ICV'!$I$110,0))","v":0.01},{"$f":"IF(R13=\"Lisier\",'BDD modélisation ICV'!$H$111,IF(R13=\"Fumier\",'BDD modélisation ICV'!$I$111,0))","v":0.24},{"$f":"IF(R13=\"Lisier\",'BDD modélisation ICV'!$H$112,IF(R13=\"Fumier\",'BDD modélisation ICV'!$I$112,0))","v":0.011},{"$f":"IF(R13=\"Lisier\",'BDD modélisation ICV'!$H$113,IF(R13=\"Fumier\",'BDD modélisation ICV'!$I$113,0))","v":0.006},0.5830951516426038,0.10259445632029741,0.006856896079629013,0.9470257506488993,0.010417283257137892,0.02367564376622248,17.56747411118245,17.56747411118245,{"$f":"IF(R13=\"Lisier\",'BDD modélisation ICV'!$E$126,IF(R13=\"Fumier\",'BDD modélisation ICV'!$F$126,0))","v":0.67},1.6670958415601491,1.4577378791065096,1.6563910023780228,1.4684427182886357,{"$f":"BI13*'BDD export Ecoinvent - SIMAPRO'!$D$60","v":18.252094099950913},{"$f":"BI13*'BDD export Ecoinvent - SIMAPRO'!$D$61","v":17.76040284309011},{"$f":"BI13*'BDD export Ecoinvent - SIMAPRO'!$D$62","v":25.752180601372707},2.2779192121422533,{"$f":"BM13*'BDD export Ecoinvent - SIMAPRO'!$E$60","v":2.4376013489134256},{"$f":"BM13*'BDD export Ecoinvent - SIMAPRO'!$E$61","v":2.224729798538732},{"$f":"BM13*'BDD export Ecoinvent - SIMAPRO'!$E$62","v":9.99753431995767},3.0063659602202755,{"$f":"BQ13*'BDD export Ecoinvent - SIMAPRO'!$F$60","v":2.5680648605138012},{"$f":"BQ13*'BDD export Ecoinvent - SIMAPRO'!$F$61","v":2.33821315102516},{"$f":"BQ13*'BDD export Ecoinvent - SIMAPRO'!$F$62","v":9.603669039592546}]
["Biomasse agricole animale","Effluents d'élevage","Porcin - Fécès, lisier frais",null,null,"Lisier",0.048431547619047624,0.6812941818181819,297.8555673846383,0.61,4.095626466551077,1.7064908769440368,2.3978096969918457,3.0063659602202755,14.848259224188315,202.9272650813075,9.828081501988445,"Lisier",{"$nulls":3},206.1059061347818,70.10318827536535,17.56747411118245,17.56747411118245,-23.25776030937814,-22.323345792654003,-45.353383960922926,{"$f":"IF(R14=\"Lisier\",'BDD modélisation ICV'!$H$101,IF(R14=\"Fumier\",'BDD modélisation ICV'!$I$101,0))","v":{"v":0.36,"d":"0.360"}},{"v":2.5256459291193027,"d":"2.53"},{"$f":"IF(R14=\"Lisier\",'BDD modélisation ICV'!$H$102,IF(R14=\"Fumier\",'BDD modélisation ICV'!$I$102,0))","v":0.11},{"$f":"IF(R14=\"Lisier\",'BDD modélisation ICV'!$H$103,IF(R14=\"Fumier\",'BDD modélisation ICV'!$I$103,0))","v":1E-4},{"$f":"IF(R14=\"Lisier\",'BDD modélisation ICV'!$H$104,IF(R14=\"Fumier\",'BDD modélisation ICV'!$I$104,0))","v":0.0008},0.14599977502743425,4.0956264665510775E-4,1.4640933767408938E-3,3.276501173240862E-3,206.1059061347818,{"$f":"AD14*FC_CH4B100+AK14/28*44*FC_N2O100","v":70.10318827536535},3.945940627703747,1.18127090704015,1.4577378791065096,{"$f":"IF(R14=\"Lisier\",'BDD modélisation ICV'!$H$107,IF(R14=\"Fumier\",'BDD modélisation ICV'!$I$107,0))","v":0.4},{"$f":"IF(R14=\"Lisier\",'BDD modélisation ICV'!$H$108,IF(R14=\"Fumier\",'BDD modélisation ICV'!$I$108,0))","v":0.026},{"$f":"IF(R14=\"Lisier\",'BDD modélisation ICV'!$H$110,IF(R14=\"Fumier\",'BDD modélisation ICV'!$I$110,0))","v":0.01},{"$f":"IF(R14=\"Lisier\",'BDD modélisation ICV'!$H$111,IF(R14=\"Fumier\",'BDD modélisation ICV'!$I$111,0))","v":0.24},{"$f":"IF(R14=\"Lisier\",'BDD modélisation ICV'!$H$112,IF(R14=\"Fumier\",'BDD modélisation ICV'!$I$112,0))","v":0.011},{"$f":"IF(R14=\"Lisier\",'BDD modélisation ICV'!$H$113,IF(R14=\"Fumier\",'BDD modélisation ICV'!$I$113,0))","v":0.006},0.5830951516426038,0.10259445632029741,0.006856896079629013,0.9470257506488993,0.010417283257137892,0.02367564376622248,17.56747411118245,17.56747411118245,{"$f":"IF(R14=\"Lisier\",'BDD modélisation ICV'!$E$126,IF(R14=\"Fumier\",'BDD modélisation ICV'!$F$126,0))","v":0.67},1.6670958415601491,1.4577378791065096,1.6563910023780228,1.4684427182886357,{"$f":"BI14*'BDD export Ecoinvent - SIMAPRO'!$D$60","v":18.252094099950913},{"$f":"BI14*'BDD export Ecoinvent - SIMAPRO'!$D$61","v":17.76040284309011},{"$f":"BI14*'BDD export Ecoinvent - SIMAPRO'!$D$62","v":25.752180601372707},2.2779192121422533,{"$f":"BM14*'BDD export Ecoinvent - SIMAPRO'!$E$60","v":2.4376013489134256},{"$f":"BM14*'BDD export Ecoinvent - SIMAPRO'!$E$61","v":2.224729798538732},{"$f":"BM14*'BDD export Ecoinvent - SIMAPRO'!$E$62","v":9.99753431995767},3.0063659602202755,{"$f":"BQ14*'BDD export Ecoinvent - SIMAPRO'!$F$60","v":2.5680648605138012},{"$f":"BQ14*'BDD export Ecoinvent - SIMAPRO'!$F$61","v":2.33821315102516},{"$f":"BQ14*'BDD export Ecoinvent - SIMAPRO'!$F$62","v":9.603669039592546}]
["Biomasse agricole animale","Effluents d'élevage","Bovin - Lisier veau",null,null,"Lisier",0.042699999999999995,0.6248461538461538,467.45076923076937,0.61,2.8907809183702335,1.559128330905771,0.47621087809814777,2.8686104471647695,12.006418846153844,292.08481526627224,12.472021611869824,"Lisier",{"$nulls":3},260.53708469505773,88.17063284282881,12.657588399119765,12.657588399119765,-15.47752380620039,-14.878032348807047,-28.84630155604915,{"$f":"IF(R15=\"Lisier\",'BDD modélisation ICV'!$H$101,IF(R15=\"Fumier\",'BDD modélisation ICV'!$I$101,0))","v":{"v":0.36,"d":"0.360"}},{"v":3.2050925305751523,"d":"3.21"},{"$f":"IF(R15=\"Lisier\",'BDD modélisation ICV'!$H$102,IF(R15=\"Fumier\",'BDD modélisation ICV'!$I$102,0))","v":0.11},{"$f":"IF(R15=\"Lisier\",'BDD modélisation ICV'!$H$103,IF(R15=\"Fumier\",'BDD modélisation ICV'!$I$103,0))","v":1E-4},{"$f":"IF(R15=\"Lisier\",'BDD modélisation ICV'!$H$104,IF(R15=\"Fumier\",'BDD modélisation ICV'!$I$104,0))","v":0.0008},0.1333920905330493,2.8907809183702335E-4,1.3368116862488633E-3,0.002312624734696187,260.53708469505773,88.17063284282881,2.754787125010651,1.079263277949217,1.2468156626553606,{"$f":"IF(R15=\"Lisier\",'BDD modélisation ICV'!$H$107,IF(R15=\"Fumier\",'BDD modélisation ICV'!$I$107,0))","v":0.4},{"$f":"IF(R15=\"Lisier\",'BDD modélisation ICV'!$H$108,IF(R15=\"Fumier\",'BDD modélisation ICV'!$I$108,0))","v":0.026},{"$f":"IF(R15=\"Lisier\",'BDD modélisation ICV'!$H$110,IF(R15=\"Fumier\",'BDD modélisation ICV'!$I$110,0))","v":0.01},{"$f":"IF(R15=\"Lisier\",'BDD modélisation ICV'!$H$111,IF(R15=\"Fumier\",'BDD modélisation ICV'!$I$111,0))","v":0.24},{"$f":"IF(R15=\"Lisier\",'BDD modélisation ICV'!$H$112,IF(R15=\"Fumier\",'BDD modélisation ICV'!$I$112,0))","v":0.011},{"$f":"IF(R15=\"Lisier\",'BDD modélisation ICV'!$H$113,IF(R15=\"Fumier\",'BDD modélisation ICV'!$I$113,0))","v":0.006},0.49872626506214424,0.07162446525027692,5.7035073031242115E-3,0.6611489100025563,0.007272638010028119,0.016528722750063906,12.657588399119765,12.657588399119765,{"$f":"IF(R15=\"Lisier\",'BDD modélisation ICV'!$E$126,IF(R15=\"Fumier\",'BDD modélisation ICV'!$F$126,0))","v":0.67},1.0103408797780447,1.2468156626553606,1.2480283630650413,1.0091281793683637,{"$f":"BI15*'BDD export Ecoinvent - SIMAPRO'!$D$60","v":12.543017347118033},{"$f":"BI15*'BDD export Ecoinvent - SIMAPRO'!$D$61","v":12.20512231269303},{"$f":"BI15*'BDD export Ecoinvent - SIMAPRO'!$D$62","v":17.697150049758022},0.4524003341932404,{"$f":"BM15*'BDD export Ecoinvent - SIMAPRO'!$E$60","v":0.4841135976201866},{"$f":"BM15*'BDD export Ecoinvent - SIMAPRO'!$E$61","v":0.4418367863898282},{"$f":"BM15*'BDD export Ecoinvent - SIMAPRO'!$E$62","v":1.985534800070333},2.8686104471647695,{"$f":"BQ15*'BDD export Ecoinvent - SIMAPRO'!$F$60","v":2.4503928614621704},{"$f":"BQ15*'BDD export Ecoinvent - SIMAPRO'!$F$61","v":2.231073249724188},{"$f":"BQ15*'BDD export Ecoinvent - SIMAPRO'!$F$62","v":9.163616706220791}]
["Biomasse agricole animale","Effluents d'élevage","Bovin - Lisiers autres",null,null,"Lisier",0.10019114569970348,0.8113577767010186,220.11768059613473,0.61,3.451948981300219,0.7172910784007143,1.6399176723913245,3.619984923457617,36.58088934901766,178.59419194106482,17.893556705888034,"Lisier",{"$nulls":3},372.9947425173954,126.25935861498061,14.28183791853918,14.28183791853918,-20.833524688521567,-19.97815059320928,-41.08069634499512,{"$f":"IF(R16=\"Lisier\",'BDD modélisation ICV'!$H$101,IF(R16=\"Fumier\",'BDD modélisation ICV'!$I$101,0))","v":{"v":0.36,"d":"0.360"}},{"v":4.5983327104631755,"d":"4.60"},{"$f":"IF(R16=\"Lisier\",'BDD modélisation ICV'!$H$102,IF(R16=\"Fumier\",'BDD modélisation ICV'!$I$102,0))","v":0.11},{"$f":"IF(R16=\"Lisier\",'BDD modélisation ICV'!$H$103,IF(R16=\"Fumier\",'BDD modélisation ICV'!$I$103,0))","v":1E-4},{"$f":"IF(R16=\"Lisier\",'BDD modélisation ICV'!$H$104,IF(R16=\"Fumier\",'BDD modélisation ICV'!$I$104,0))","v":0.0008},0.061368236707616666,3.4519489813002191E-4,6.1713431605746685E-4,2.7615591850401753E-3,372.9947425173954,126.25935861498061,3.3874739905094327,0.4965248242707166,0.7856197408945882,{"$f":"IF(R16=\"Lisier\",'BDD modélisation ICV'!$H$107,IF(R16=\"Fumier\",'BDD modélisation ICV'!$I$107,0))","v":0.4},{"$f":"IF(R16=\"Lisier\",'BDD modélisation ICV'!$H$108,IF(R16=\"Fumier\",'BDD modélisation ICV'!$I$108,0))","v":0.026},{"$f":"IF(R16=\"Lisier\",'BDD modélisation ICV'!$H$110,IF(R16=\"Fumier\",'BDD modélisation ICV'!$I$110,0))","v":0.01},{"$f":"IF(R16=\"Lisier\",'BDD modélisation ICV'!$H$111,IF(R16=\"Fumier\",'BDD modélisation ICV'!$I$111,0))","v":0.24},{"$f":"IF(R16=\"Lisier\",'BDD modélisation ICV'!$H$112,IF(R16=\"Fumier\",'BDD modélisation ICV'!$I$112,0))","v":0.011},{"$f":"IF(R16=\"Lisier\",'BDD modélisation ICV'!$H$113,IF(R16=\"Fumier\",'BDD modélisation ICV'!$I$113,0))","v":0.006},0.3142478963578353,0.08807432375324524,0.004023222201110806,0.8129937577222638,0.008942931334944901,0.020324843943056597,14.28183791853918,14.28183791853918,{"$f":"IF(R16=\"Lisier\",'BDD modélisation ICV'!$E$126,IF(R16=\"Fumier\",'BDD modélisation ICV'!$F$126,0))","v":0.67},1.743242347241946,0.7856197408945882,1.235640821776401,1.2932212663601332,{"$f":"BI16*'BDD export Ecoinvent - SIMAPRO'!$D$60","v":16.074168880875103},{"$f":"BI16*'BDD export Ecoinvent - SIMAPRO'!$D$61","v":15.641148524046484},{"$f":"BI16*'BDD export Ecoinvent - SIMAPRO'!$D$62","v":22.67930998878501},1.5579217887717582,{"$f":"BM16*'BDD export Ecoinvent - SIMAPRO'!$E$60","v":1.6671321061646587},{"$f":"BM16*'BDD export Ecoinvent - SIMAPRO'!$E$61","v":1.5215443150039376},{"$f":"BM16*'BDD export Ecoinvent - SIMAPRO'!$E$62","v":6.8375456284982725},3.619984923457617,{"$f":"BQ16*'BDD export Ecoinvent - SIMAPRO'!$F$60","v":3.0922237014818075},{"$f":"BQ16*'BDD export Ecoinvent - SIMAPRO'!$F$61","v":2.8154577541588552},{"$f":"BQ16*'BDD export Ecoinvent - SIMAPRO'!$F$62","v":11.563840727711831}]
["Biomasse agricole animale","Effluents d'élevage","Bovin - Fumier",null,null,"Fumier",0.23669615384615386,0.824219139445907,171.53847073983206,0.64,5.423370712898735,0.6237621311657071,2.4490771115368704,10.113683090683733,87.79027510495483,141.38529073505129,33.465354527406895,"Fumier",{"$nulls":3},76.38457469338654,56.27920300996742,21.91779354657402,21.91779354657402,-32.671833775205904,-31.1008268508594,-72.91414395900463,{"$f":"IF(R17=\"Lisier\",'BDD modélisation ICV'!$H$101,IF(R17=\"Fumier\",'BDD modélisation ICV'!$I$101,0))","v":0.015},{"v":0.35833390784177466,"d":"0.36"},{"$f":"IF(R17=\"Lisier\",'BDD modélisation ICV'!$H$102,IF(R17=\"Fumier\",'BDD modélisation ICV'!$I$102,0))","v":0.32},{"$f":"IF(R17=\"Lisier\",'BDD modélisation ICV'!$H$103,IF(R17=\"Fumier\",'BDD modélisation ICV'!$I$103,0))","v":0.01},{"$f":"IF(R17=\"Lisier\",'BDD modélisation ICV'!$H$104,IF(R17=\"Fumier\",'BDD modélisation ICV'!$I$104,0))","v":0.02},0.15524746375679824,0.05423370712898735,0.002094811708857856,0.1084674142579747,76.38457469338654,56.27920300996742,5.1054221277549745,0.3299008604831961,0.807452987210374,{"$f":"IF(R17=\"Lisier\",'BDD modélisation ICV'!$H$107,IF(R17=\"Fumier\",'BDD modélisation ICV'!$I$107,0))","v":0.7},{"$f":"IF(R17=\"Lisier\",'BDD modélisation ICV'!$H$108,IF(R17=\"Fumier\",'BDD modélisation ICV'!$I$108,0))","v":0.026},{"$f":"IF(R17=\"Lisier\",'BDD modélisation ICV'!$H$110,IF(R17=\"Fumier\",'BDD modélisation ICV'!$I$110,0))","v":0.01},{"$f":"IF(R17=\"Lisier\",'BDD modélisation ICV'!$H$111,IF(R17=\"Fumier\",'BDD modélisation ICV'!$I$111,0))","v":0.24},{"$f":"IF(R17=\"Lisier\",'BDD modélisation ICV'!$H$112,IF(R17=\"Fumier\",'BDD modélisation ICV'!$I$112,0))","v":0.011},{"$f":"IF(R17=\"Lisier\",'BDD modélisation ICV'!$H$113,IF(R17=\"Fumier\",'BDD modélisation ICV'!$I$113,0))","v":0.006},0.5652170910472617,0.13274097532162932,0.00697958066368891,1.2253013106611939,0.013478314417273131,0.030632532766529847,21.91779354657402,21.91779354657402,{"$f":"IF(R17=\"Lisier\",'BDD modélisation ICV'!$E$126,IF(R17=\"Fumier\",'BDD modélisation ICV'!$F$126,0))","v":0.67},2.879639324164882,0.807452987210374,1.9538919097966145,1.7332004015786415,{"$f":"BI17*'BDD export Ecoinvent - SIMAPRO'!$D$60","v":21.542915109793217},{"$f":"BI17*'BDD export Ecoinvent - SIMAPRO'!$D$61","v":20.962572769414404},{"$f":"BI17*'BDD export Ecoinvent - SIMAPRO'!$D$62","v":30.395254240384826},2.3266232559600266,{"$f":"BM17*'BDD export Ecoinvent - SIMAPRO'!$E$60","v":2.4897195462028248},{"$f":"BM17*'BDD export Ecoinvent - SIMAPRO'!$E$61","v":2.27229660293336},{"$f":"BM17*'BDD export Ecoinvent - SIMAPRO'!$E$62","v":10.211290956713452},10.113683090683733,{"$f":"BQ17*'BDD export Ecoinvent - SIMAPRO'!$F$60","v":8.639199119209861},{"$f":"BQ17*'BDD export Ecoinvent - SIMAPRO'!$F$61","v":7.8659574785116355},{"$f":"BQ17*'BDD export Ecoinvent - SIMAPRO'!$F$62","v":32.30759876190636}]
["Biomasse agricole végétale ","Cultures principales","Betteraves",null,null,"Cultures dédiées",0.23,0.9,400,0.5635,2.17515,0,0.68940625,2.4716666666666667,93.15,360,82.8]
["Biomasse agricole végétale ","Cultures principales","Céréales, ensilées, non ensilées",null,null,"Cultures dédiées",0.36697818383167224,0.9392329085442732,346.9792236223779,0.5733,5.41625,0,2.8612500000000005,6.057499999999999,155.10509413763242,325.8943054072798,119.59610031944786]
["Biomasse agricole végétale ","Cultures principales","Oléoprotéagineux, ensilées, non ensilées",null,null,"Cultures dédiées",0.52215,0.9177010699133468,347.45685493980443,0.5512,14.826125,0,4.7775,13.6375,215.62992614486433,318.86152752698507,166.49354659821526]
["Biomasse agricole végétale ","Cultures principales","Fourrages, ensilés, non ensilés",null,null,"Cultures dédiées",0.6246999999999999,0.9237165031736874,219.36364309691402,0.5681,12.414873888888888,0,3.2054003086419756,11.37865925925926,259.6705647896711,202.6298173249222,126.58284688287887]
["Biomasse agricole végétale ","Cultures principales","Prairies temporaires, ensilées, non ensilées",null,null,"Cultures dédiées",0.3694625000000001,0.8722907407407406,271.5181726747972,0.5681,12.414873888888888,0,3.2054003086419756,11.37865925925926,145.02542301041672,236.84278796707116,87.50452854928405]
["Biomasse agricole végétale ","Cultures principales déclassées","Betteraves déclassées",null,null,"Déchets/Résidus de cultures/Cultures dédiées déclassées",0.20125,0.9425,331.33823125000004,0.5635,2.17515,0,0.68940625,2.4716666666666667,85.35515625000001,312.286282953125,62.84761444431641]
["Biomasse agricole végétale ","Cultures principales déclassées","Céréales déclassées, ensilées, non ensilées",null,null,"Déchets/Résidus de cultures/Cultures dédiées déclassées",0.30954,0.9321560923153279,269.60388395500246,0.5733,5.41625,0,2.8612500000000005,6.057499999999999,129.84281856687895,251.31290294053022,77.79139597621172]
["Biomasse agricole végétale ","Cultures principales déclassées","Fourrages déclassés, ensilés, non ensilés",null,null,"Déchets/Résidus de cultures/Cultures dédiées déclassées",0.4837499999999999,0.8858499999999999,237.28599161,0.5681,12.414873888888888,0,3.2054003086419756,11.37865925925926,192.83847187499995,210.1997956677185,101.6841511542588]
["Biomasse agricole végétale ","Cultures principales déclassées","Autres ensilée, non ensilée",null,null,"Déchets/Résidus de cultures/Cultures dédiées déclassées",0.8292,0.9164254703328508,145.72828071692905,0.5681,12.414873888888888,0,3.2054003086419756,11.37865925925926,341.9549999999999,133.5491081968094,110.73892051679437]
["Biomasse agricole végétale ","CIVE d'hiver","Betteraves CIVE",null,null,"CIVES",0.105,0.9143000000000001,311.80729477000006,0.5635,2.17515,0,0.68940625,2.4716666666666667,43.200675000000004,285.0854096082111,29.933968008862163]
["Biomasse agricole végétale ","CIVE d'hiver","Céréales immatures, ensilées, non ensilées",null,null,"CIVES",0.3159986111111111,0.8507026566122046,293.9610690753792,0.5733,5.41625,0,2.8612500000000005,6.057499999999999,120.9693860810951,250.07346240298887,79.02286679509115]
["Biomasse agricole végétale ","CIVE d'hiver","Oléoprotéagineux CIVE, ensilées, non ensilées",null,null,"CIVES",0.209,0.9170653907496014,266.59983109869796,0.5512,14.826125,0,4.7775,13.6375,86.25000000000001,244.48947828030518,51.09830096058378]
["Biomasse agricole végétale ","CIVE d'hiver","Fourrages CIVE, ensilés, non ensilés",null,null,"CIVES",0.25030312499999996,0.8591253903974251,259.4149659644461,0.5681,12.414873888888888,0,3.2054003086419756,11.37865925925926,96.7687964924942,222.86998390913948,55.78505344115732]
["Biomasse agricole végétale ","CIVE d'hiver","Mélanges - Autres - Immatures , ensilée, non ensilée",null,null,"CIVES",0.314,0.911,205.64695451100005,0.5681,12.414873888888888,0,3.2054003086419756,11.37865925925926,128.72430000000003,187.34437555952104,58.826133925689604]
["Biomasse agricole végétale ","CIVE d'hiver","Prairies permanentes (avec fertilisation chimique), ensilées, non ensilées",null,null,"CIVES",0.3694625000000001,0.8722907407407406,271.5181726747972,0.5681,12.414873888888888,0,3.2054003086419756,11.37865925925926,145.02542301041672,236.84278796707116,87.50452854928405]
["Biomasse agricole végétale ","CIVE d'été","Céréales immatures, ensilées, non ensilées",null,null,"CIVES",0.3159986111111111,0.8507026566122046,293.9610690753792,0.5733,5.41625,0,2.8612500000000005,6.057499999999999,120.9693860810951,250.07346240298887,79.02286679509115]
["Biomasse agricole végétale ","CIVE d'été","Oléoprotéagineux CIVE, ensilées, non ensilées",null,null,"CIVES",0.209,0.9170653907496014,266.59983109869796,0.5512,14.826125,0,4.7775,13.6375,86.25000000000001,244.48947828030518,51.09830096058378]
["Biomasse agricole végétale ","CIVE d'été","Fourrages CIVE, ensilés, non ensilés",null,null,"CIVES",0.25030312499999996,0.8591253903974251,259.4149659644461,0.5681,12.414873888888888,0,3.2054003086419756,11.37865925925926,96.7687964924942,222.86998390913948,55.78505344115732]
["Biomasse agricole végétale ","CIVE d'été","Mélanges - Autres - Immatures , ensilée, non ensilée",null,null,"CIVES",0.314,0.911,205.64695451100005,0.5681,12.414873888888888,0,3.2054003086419756,11.37865925925926,128.72430000000003,187.34437555952104,58.826133925689604]
["Biomasse agricole végétale ","Déchets/Résidus","Aliments pour animaux (bétails)",null,null,"Déchets/Résidus de cultures/Cultures dédiées déclassées",0.873,0.8769199999999999,293.584,0.5681,12.414873888888888,0,3.2054003086419756,11.37865925925926,344.49802199999993,257.44968128,224.75357175744]
["Biomasse agricole végétale ","Déchets/Résidus de cultures","Semences déclassées",null,null,"Déchets/Résidus de cultures/Cultures dédiées déclassées",0.8775,0.976,320,0.51,18.947000000000003,0,9.208499999999999,11.1496,385.398,312.32,274.0608]
["Biomasse agricole végétale ","Déchets/Résidus de cultures","Graines",null,null,"Déchets/Résidus de cultures/Cultures dédiées déclassées",0.968,0.9056641520111907,230.51952,0.5426,17.553819642857146,0,7.314285714285714,5.814285714285715,394.50730461607463,208.7732656028267,202.09252110353626]
["Biomasse agricole végétale ","Déchets/Résidus de cultures","Issus de stockage - céréales",null,null,"Déchets/Résidus de cultures/Cultures dédiées déclassées",0.7550897435897437,0.9056641520111907,299.7001528310703,0.55,16.97344,2.5,6.108,9.054,307.7359705442487,271.4276847713755,204.95226089717568]
["Biomasse agricole végétale ","Déchets/Résidus de cultures","Issus de stockage - autres",null,null,"Déchets/Résidus de cultures/Cultures dédiées déclassées",0.7550897435897437,0.9056641520111907,299.7001528310703,0.55,16.97344,2.5,6.108,9.054,307.7359705442487,271.4276847713755,204.95226089717568]
["Biomasse agricole végétale ","Déchets/Résidus de cultures","Menues paille",null,null,"Déchets/Résidus de cultures/Cultures dédiées déclassées",0.86,0.8975716995556295,276,0.55,16.97344,2.5,6.108,9.054,347.36024772802864,247.72978907735376,213.04761860652422]
["Biomasse agricole végétale ","Déchets/Résidus de cultures","Pailles",null,null,"Déchets/Résidus de cultures/Cultures dédiées déclassées",0.7569444444444445,0.8975716995556295,205.8095953952528,0.5352,6.04084,0,2.407244,14.80478,305.7353601611363,184.72886832377353,139.8294906061897]
["Biomasse agricole végétale ","Déchets/Résidus de cultures","Résidus de séchage céréales ",null,null,"Déchets/Résidus de cultures/Cultures dédiées déclassées",0.89235,0.91405,286.7,0.5285,8.7,0.2001,3.2,2.6,367.043632875,262.058135,233.84757676725]
["Biomasse agricole végétale ","Déchets/Résidus de cultures","Rafles, épis, spathes",null,null,"Déchets/Résidus de cultures/Cultures dédiées déclassées",0.6075714285714287,0.7404333333333334,233.31950958975,0.5805,7.610591666666667,0,1.65,8.8125,202.4397621428572,172.75754221723724,104.96254672141573]
["Biomasse agricole végétale ","Déchets/Résidus de cultures","Feuilles et fanes",null,null,"Déchets/Résidus de cultures/Cultures dédiées déclassées",0.18230000000000002,0.7580058636686886,223.19228083976503,0.6219,3.8037333333333336,0,1.155,8.92,62.18301102606088,169.1810576021306,30.841706800868412]
["Biomasse agricole végétale ","Déchets/Résidus de cultures","Rejets aqueux",null,null,"Déchets/Résidus de cultures/Cultures dédiées déclassées",0.015,0.379,270.4,0.6,0.151,0.013,0.32060000000000005,0.22895000000000001,2.55825,102.48159999999999,1.5372239999999997]
["Déchets/Résidus de collectivité","Déchets verts","Autres déchets verts",null,null,"Déchets/Résidus de collectivité",0.33143999999999996,0.839951186440678,207.09603730054062,0.577,10.383666666666668,0.3,2.52425,8.339166666666666,125.2770395552542,173.950562237752,57.65417434808052,"Enfouissement",{"$f":"'BDD export Ecoinvent - SIMAPRO'!$AA$8","v":1.7740259},{"$f":"'BDD export Ecoinvent - SIMAPRO'!$AA$9","v":0.6138256},{"$f":"'BDD export Ecoinvent - SIMAPRO'!$AA$10","v":{"v":0.0938888888888889,"d":"9.39E-02"}}]
["Déchets/Résidus de collectivité","Déchets verts","Tontes de pelouse",null,null,"Déchets/Résidus de collectivité",0.35927142857142863,0.7831206213074138,176.1245139075019,0.577,10.383666666666668,0.3,2.52425,8.339166666666666,126.6087889623867,137.92673875870912,49.55313647203966,"Enfouissement",{"$f":"'BDD export Ecoinvent - SIMAPRO'!$AA$8","v":1.7740259},{"$f":"'BDD export Ecoinvent - SIMAPRO'!$AA$9","v":0.6138256},{"$f":"'BDD export Ecoinvent - SIMAPRO'!$AA$10","v":{"v":0.0938888888888889,"d":"9.39E-02"}}]
["Déchets/Résidus de collectivité","Biodéchets","Déchets restauration",null,null,"Déchets/Résidus de collectivité",0.26965,0.8219,324.96242216135,0.61,8.085249999999998,0.59856,2.6549166666666664,2.435,99.73140074999999,267.08661477441353,72.0199056739206,"Enfouissement",{"$f":"'BDD export Ecoinvent - SIMAPRO'!$AA$8","v":1.7740259},{"$f":"'BDD export Ecoinvent - SIMAPRO'!$AA$9","v":0.6138256},{"$f":"'BDD export Ecoinvent - SIMAPRO'!$AA$10","v":{"v":0.0938888888888889,"d":"9.39E-02"}}]
["Déchets/Résidus de collectivité","Biodéchets","FFOM, marchés, GMS",null,null,"Déchets/Résidus de collectivité",0.293,0.741,143.859222,0.6442,6.80507142857143,0.01104,3.120833333333333,4.386,97.70084999999999,106.59968350199999,31.233707266085997,"Enfouissement",{"$f":"'BDD export Ecoinvent - SIMAPRO'!$AA$8","v":1.7740259},{"$f":"'BDD export Ecoinvent - SIMAPRO'!$AA$9","v":0.6138256},{"$f":"'BDD export Ecoinvent - SIMAPRO'!$AA$10","v":{"v":0.0938888888888889,"d":"9.39E-02"}}]
["Déchets/Résidus de collectivité","Biodéchets","Soupe de déconditionnement",null,null,"Déchets/Résidus de collectivité",0.1825,0.8682324324324324,426.559181081081,0.6442,3.6,0,3.6,2.67,71.30358851351352,370.3525153664134,67.58933405437044,"Enfouissement",{"$f":"'BDD export Ecoinvent - SIMAPRO'!$AA$8","v":1.7740259},{"$f":"'BDD export Ecoinvent - SIMAPRO'!$AA$9","v":0.6138256},{"$f":"'BDD export Ecoinvent - SIMAPRO'!$AA$10","v":{"v":0.0938888888888889,"d":"9.39E-02"}}]
["Déchets/Résidus de collectivité","Algues","Fraîches",null,null,"Déchets d'industrie (IAA végétales)",0.1535,0.98,323.2125,0.6,6.627666666666666,0.1,0.8718250000000001,8.308024999999999,67.6935,316.74825,48.620856374999995,"Enfouissement",{"$f":"'BDD export Ecoinvent - SIMAPRO'!$AA$8","v":1.7740259},{"$f":"'BDD export Ecoinvent - SIMAPRO'!$AA$9","v":0.6138256},{"$f":"'BDD export Ecoinvent - SIMAPRO'!$AA$10","v":{"v":0.0938888888888889,"d":"9.39E-02"}}]
["Déchets/Résidus de collectivité","Graisses/huiles usagées (HCU, HAU)","Graisses/huiles usagées (HCU, HAU)",null,null,"Déchets d'industrie (IAA végétales)",0.7093333333333334,0.84125,735,0.665,3.6651499999999997,0,0,0,268.52700000000004,618.31875,438.5941,"Incinération",{"$f":"'BDD export Ecoinvent - SIMAPRO'!$Y$8","v":0.0400883},{"$f":"'BDD export Ecoinvent - SIMAPRO'!$Y$9","v":0.0379757},{"$f":"'BDD export Ecoinvent - SIMAPRO'!$Y$10","v":{"v":0.06944444444444445,"d":"6.94E-02"}}]
["Déchets/Résidus de collectivité","STEP/STEU","Autres (Boues et eaux résiduaires)",null,null,"Déchets de STEU",0.14473809523809522,0.8199965517241378,285.96168976086966,0.65,2.6692550000000006,0.4200711333333333,3.2659999999999996,0.5935714285714286,53.40813254926106,234.48759952912079,33.939288512798214,"Traitement de l'eau",{"$f":"'BDD export Ecoinvent - SIMAPRO'!$Z$8","v":0.413972},{"$f":"'BDD export Ecoinvent - SIMAPRO'!$Z$9","v":0.35857},{"$f":"'BDD export Ecoinvent - SIMAPRO'!$Z$10","v":{"v":0.9361111111111111,"d":"9.36E-01"}}]
["Déchets/Résidus de collectivité","STEP/STEU","Graisses de flottation",null,null,"Déchets de STEU",0.34231,0.89772995951417,568.5661298960879,0.65,5.380111111111112,0.05171166666666668,2.1094444444444442,0.28308333333333335,138.285874098583,510.41884877274333,174.72147612339776,"Incinération",{"$f":"'BDD export Ecoinvent - SIMAPRO'!$Y$8","v":0.0400883},{"$f":"'BDD export Ecoinvent - SIMAPRO'!$Y$9","v":0.0379757},{"$f":"'BDD export Ecoinvent - SIMAPRO'!$Y$10","v":{"v":0.06944444444444445,"d":"6.94E-02"}}]
["Déchets/Résidus d'industrie","IAA","Boues d'IAA",null,null,"Déchets de STEU",0.1977844736842105,0.6331398994126419,288.0182985406513,0.61,6.374999999999999,0.797,9.360375000000001,0.704925,56.351358798211514,182.35587656702825,36.06716107003254,"Fumier",{"$nulls":3},{"$f":"AL57","v":87.02636804664529},65.20195050217102,{"$f":"BC57","v":25.789465987999996},25.789465987999996,{"$f":"-BJ57-BN57-BR57","v":-35.23000279079509},-33.66862376596081,-76.71053851137658,{"$f":"IF(R57=\"Lisier\",'BDD modélisation ICV'!$H$101,IF(R57=\"Fumier\",'BDD modélisation ICV'!$I$101,0))","v":0.015},{"$f":"Q57*AC57*massevol_CH4","v":{"v":0.38619303316805237,"d":"0.39"}},{"$f":"IF(R57=\"Lisier\",'BDD modélisation ICV'!$H$102,IF(R57=\"Fumier\",'BDD modélisation ICV'!$I$102,0))","v":0.32},{"$f":"IF(R57=\"Lisier\",'BDD modélisation ICV'!$H$103,IF(R57=\"Fumier\",'BDD modélisation ICV'!$I$103,0))","v":0.01},{"$f":"IF(R57=\"Lisier\",'BDD modélisation ICV'!$H$104,IF(R57=\"Fumier\",'BDD modélisation ICV'!$I$104,0))","v":0.02},{"$f":"L57*AE57/18*14","v":0.19836444444444445},{"$f":"K57*AF57","v":0.06374999999999999},{"$f":"(AH57+AI57)*0.01","v":2.6211444444444445E-3},{"$f":"K57*AG57","v":0.12749999999999997},{"$f":"AD57*FC_CH4B20+(AK57+AJ57)/28*44*FC_N2O20","v":87.02636804664529},{"$f":"AD57*FC_CH4B100+AK57/28*44*FC_N2O100","v":65.20195050217102},{"$f":"K57-AH57-AI57-AK57","v":5.985385555555554},{"$f":"L57/18*14-AH57","v":0.4215244444444445},{"$f":"AO57+(AN57-AO57)*0.1","v":0.9779105555555555},{"$f":"IF(R57=\"Lisier\",'BDD modélisation ICV'!$H$107,IF(R57=\"Fumier\",'BDD modélisation ICV'!$I$107,0))","v":0.7},{"$f":"IF(R57=\"Lisier\",'BDD modélisation ICV'!$H$108,IF(R57=\"Fumier\",'BDD modélisation ICV'!$I$108,0))","v":0.026},{"$f":"IF(R57=\"Lisier\",'BDD modélisation ICV'!$H$110,IF(R57=\"Fumier\",'BDD modélisation ICV'!$I$110,0))","v":0.01},{"$f":"IF(R57=\"Lisier\",'BDD modélisation ICV'!$H$111,IF(R57=\"Fumier\",'BDD modélisation ICV'!$I$111,0))","v":0.24},{"$f":"IF(R57=\"Lisier\",'BDD modélisation ICV'!$H$112,IF(R57=\"Fumier\",'BDD modélisation ICV'!$I$112,0))","v":0.011},{"$f":"IF(R57=\"Lisier\",'BDD modélisation ICV'!$H$113,IF(R57=\"Fumier\",'BDD modélisation ICV'!$I$113,0))","v":0.006},{"$f":"AP57*AQ57","v":0.6845373888888888},{"$f":"AN57*AR57","v":0.1556200244444444},{"$f":"(AW57+AX57)*AS57","v":0.008401574133333332},{"$f":"AN57*AT57","v":1.436492533333333},{"$f":"AZ57*AU57","v":0.01580141786666666},{"$f":"AN57*AV57","v":0.03591231333333333},{"$f":"(BA57+AY57+BB57)/28*44*FC_N2O20","v":25.789465987999996},{"$f":"(BA57+AY57+BB57)/28*44*FC_N2O100","v":25.789465987999996},{"$f":"IF(R57=\"Lisier\",'BDD modélisation ICV'!$E$126,IF(R57=\"Fumier\",'BDD modélisation ICV'!$F$126,0))","v":0.67},{"$f":"(AN57-AP57)*BE57","v":3.355008249999999},{"$f":"AP57","v":0.9779105555555555},{"$f":"AW57+AX57+AZ57+BB57","v":2.312562259999999},{"$f":"BF57+BG57-BH57","v":2.020356545555556},{"$f":"BI57*'BDD export Ecoinvent - SIMAPRO'!$D$60","v":25.11213908834509},{"$f":"BI57*'BDD export Ecoinvent - SIMAPRO'!$D$61","v":24.435645795948307},{"$f":"BI57*'BDD export Ecoinvent - SIMAPRO'!$D$62","v":35.431131219709904},{"$f":"M57*0.95","v":8.89235625},{"$f":"BM57*'BDD export Ecoinvent - SIMAPRO'!$E$60","v":9.515710423125},{"$f":"BM57*'BDD export Ecoinvent - SIMAPRO'!$E$61","v":8.6847197315625},{"$f":"BM57*'BDD export Ecoinvent - SIMAPRO'!$E$62","v":39.02756354166667},{"$f":"N57","v":0.704925},{"$f":"BQ57*'BDD export Ecoinvent - SIMAPRO'!$F$60","v":0.6021532793250001},{"$f":"BQ57*'BDD export Ecoinvent - SIMAPRO'!$F$61","v":0.54825823845},{"$f":"BQ57*'BDD export Ecoinvent - SIMAPRO'!$F$62","v":2.25184375}]
["Déchets/Résidus d'industrie","Papeterie","Boues de papeterie",null,null,"Déchets de STEU",0.1,0.66,330,0.6,5.37,0,3.2365333333333335,0.789275,29.7,217.8,21.78,"Traitement de l'eau",{"$f":"'BDD export Ecoinvent - SIMAPRO'!$Z$8","v":0.413972},{"$f":"'BDD export Ecoinvent - SIMAPRO'!$Z$9","v":0.35857},{"$f":"'BDD export Ecoinvent - SIMAPRO'!$Z$10","v":{"v":0.9361111111111111,"d":"9.36E-01"}}]
["Déchets/Résidus d'industrie","IAA animales","Babeurre frais, caséine",null,null,"Déchets d'industrie (IAA animales)",0.88,0.9309999999999999,479,0.592,3.7837,0,1.9678666666666667,1.8153666666666666,368.67599999999993,445.94899999999996,392.43512]
["Déchets/Résidus d'industrie","IAA animales","Crème, fromages, lait entier, petit lait",null,null,"Déchets d'industrie (IAA animales)",0.31851034482758633,0.9379785714285716,460.1793142857143,0.6489,11.55265,0,3.481815,1.7818866666666668,134.44014520197052,431.63833581469396,137.48127518114367]
["Déchets/Résidus d'industrie","IAA animales","Lactose, lactoserum, lait écrémé",null,null,"Déchets d'industrie (IAA animales)",0.06786874999999999,0.8782413757255747,371.91381444349724,0.5775,6.128433333333334,0.19029069999999998,7.096811111111111,11.411833333333334,26.82231496594879,326.63010004820313,22.167976602646483]
["Déchets/Résidus d'industrie","IAA animales","Autres déchets animaux issus d'abattoirs",null,null,"Déchets d'industrie (IAA animales)",0.31022771428571433,0.9271349098400374,442.84997858042414,0.8,23.48730769230769,0.3510000000000001,13.125100000000003,1.2603900000000001,129.430324761375,410.581674963824,127.37381455162722,"Incinération",{"$f":"'BDD export Ecoinvent - SIMAPRO'!$Y$8","v":0.0400883},{"$f":"'BDD export Ecoinvent - SIMAPRO'!$Y$9","v":0.0379757},{"$f":"'BDD export Ecoinvent - SIMAPRO'!$Y$10","v":{"v":0.06944444444444445,"d":"6.94E-02"}}]
["Déchets/Résidus d'industrie","IAA animales","Stercoraires",null,null,"Déchets d'industrie (IAA animales)",0.4689857142857143,0.9181433590396229,337.35364624525016,0.5825,3.5923125,1.0439,1.9861851851851853,0.8857619047619046,193.76825357514716,309.7390099478786,145.26317082255582,"Incinération",{"$f":"'BDD export Ecoinvent - SIMAPRO'!$Y$8","v":0.0400883},{"$f":"'BDD export Ecoinvent - SIMAPRO'!$Y$9","v":0.0379757},{"$f":"'BDD export Ecoinvent - SIMAPRO'!$Y$10","v":{"v":0.06944444444444445,"d":"6.94E-02"}}]
["Déchets/Résidus d'industrie","IAA animales","Graisses animales de flottation",null,null,"Déchets d'industrie (IAA animales)",0.23820987654320983,0.8053619047619047,579.7675912698411,0.69,4.998333333333333,0.39233333333333337,2.2872166666666662,0.3896716666666667,86.33032195767194,466.92273162430064,111.22560625544295,"Incinération",{"$f":"'BDD export Ecoinvent - SIMAPRO'!$Y$8","v":0.0400883},{"$f":"'BDD export Ecoinvent - SIMAPRO'!$Y$9","v":0.0379757},{"$f":"'BDD export Ecoinvent - SIMAPRO'!$Y$10","v":{"v":0.06944444444444445,"d":"6.94E-02"}}]
["Déchets/Résidus d'industrie","IAA animales","Rejets aqueux de l'industrie du lait",null,null,"Déchets d'industrie (IAA animales)",0.17625,0.8532666666666667,346.1159357142857,0.6,0.151,0.013,0.32060000000000005,0.22895000000000001,67.6747125,295.32919074714283,52.05176986918392,"Traitement de l'eau",{"$f":"'BDD export Ecoinvent - SIMAPRO'!$Z$8","v":0.413972},{"$f":"'BDD export Ecoinvent - SIMAPRO'!$Z$9","v":0.35857},{"$f":"'BDD export Ecoinvent - SIMAPRO'!$Z$10","v":{"v":0.9361111111111111,"d":"9.36E-01"}}]
["Déchets/Résidus d'industrie","IAA animales","Déchets de poissons",null,null,"Déchets d'industrie (IAA animales)",0.4722,0.9090857142857144,417.76613594012144,0.8,23.48730769230769,0.3510000000000001,13.125100000000003,1.2603900000000001,193.17162342857148,379.78522609550816,179.33458376229896,"Incinération",{"$f":"'BDD export Ecoinvent - SIMAPRO'!$Y$8","v":0.0400883},{"$f":"'BDD export Ecoinvent - SIMAPRO'!$Y$9","v":0.0379757},{"$f":"'BDD export Ecoinvent - SIMAPRO'!$Y$10","v":{"v":0.06944444444444445,"d":"6.94E-02"}}]
["Déchets/Résidus d'industrie","IAA Confiserie/chocolaterie/Pâtisserie","Pâtisserie",null,null,"Déchets d'industrie (IAA autres)",0.746,0.97960661345496,448.8748558434281,0.53,6.80507142857143,0.01104,3.120833333333333,4.386,328.8539401368301,439.720777397864,328.0316999388066]
["Déchets/Résidus d'industrie","IAA Confiserie/chocolaterie/Pâtisserie","Boulangerie",null,null,"Déchets d'industrie (IAA autres)",0.6106,0.9596095640690098,363.0238651394967,0.57,9.425,0,3.76215,3.04955,263.6719199192418,348.3611729731594,212.70933221741114]
["Déchets/Résidus d'industrie","IAA Confiserie/chocolaterie/Pâtisserie","Confiserie",null,null,"Déchets d'industrie (IAA autres)",0.9506666666666667,0.9267749999999998,320.9775,0.6442,6.80507142857143,0.01104,3.120833333333333,4.386,{"$f":"G69*H69*0.45*1000","v":396.47434499999997},297.4739225625,282.79854238275]
["Déchets/Résidus d'industrie","IAA végétales","Industrie alcools et jus Lies de vin",null,null,"Déchets d'industrie (IAA végétales)",0.2813294117647059,0.85,398.99999999999994,0.6,1.522375,0.0375,2.1068000000000002,4.0006,107.60849999999999,339.1499999999999,95.41286999999998]
["Déchets/Résidus d'industrie","IAA végétales","Industrie alcools et jus Marc de fruits",null,null,"Déchets d'industrie (IAA végétales)",0.2813294117647059,0.9057021394460364,276.91867664895375,0.65,9.739579365079365,0.03166666666666667,4.770499999999999,12.719710714285714,114.66029255597506,250.80583789352258,70.55905884173889]
["Déchets/Résidus d'industrie","IAA végétales","Industrie alcools et jus Autres",null,null,"Déchets d'industrie (IAA végétales)",0.27586264367816093,0.899612060041408,327.22547275269125,0.627,9.046107700617284,0.8015,3.758244510582011,5.0530883125,111.67621252550067,294.3759816410722,81.20733653085995]
["Déchets/Résidus d'industrie","IAA végétales","Féculerie/ transformation de pomme de terre",null,null,"Déchets d'industrie (IAA végétales)",0.26204999999999995,0.914667868745939,311.53379322544396,0.523,2.7881951666666667,0,1.8716373333333332,7.033592638888889,107.85992175219297,284.94995069185484,74.67113457880055]
["Déchets/Résidus d'industrie","IAA végétales","Industrie des corps gras végétaux Autres",null,null,"Déchets d'industrie (IAA végétales)",0.67,0.9666666666666667,486,0.613,22.9244,0,10.533290000000001,15.371466666666665,291.45000000000005,469.8,314.766]
["Déchets/Résidus d'industrie","IAA végétales","Industrie des corps gras végétaux Matières filtrantes",null,null,"Déchets d'industrie (IAA végétales)",0.6412857142857143,0.5021666666666667,511.8283333333334,0.6,0.7287499999999999,0,6.5952,0,144.9145392857143,257.02312805555556,164.82526026305558]
["Déchets/Résidus d'industrie","IAA végétales","Industrie des corps gras végétaux Graisses issues de la production de margarine ; huiles alimentaires",null,null,"Déchets d'industrie (IAA végétales)",0.9170714285714286,0.9530488721804512,624.8293975322516,0.6,1.395,0,1.56,0.905,393.3062508190119,595.4929526233032,546.1095727664707]
["Déchets/Résidus d'industrie","IAA végétales","Industrie des corps gras végétaux Tourteaux autres, sons",null,null,"Déchets d'industrie (IAA végétales)",0.8946875,0.9275,377.2989,0.591,48.28386462585035,0,16.91639186507937,15.025718911564626,373.42019531249997,349.94472975,313.0911753982031]
["Déchets/Résidus d'industrie","IAA végétales","Meunerie et maïserie",null,null,"Déchets d'industrie (IAA végétales)",0.7350000000000001,0.9224947368421051,357.04054358974355,0.6,14.531818181818181,0.02190909090909091,22.968454545454545,8.666727272727274,305.1151342105263,329.3680223007826,242.08549639107525]
["Déchets/Résidus d'industrie","IAA végétales","Amidonnerie Eau de process d'amidonnerie",null,null,"Déchets d'industrie (IAA végétales)",0.16966666666666666,0.5613333333333334,487.045,0.6,1.2,0.11196,0.36,0,42.857800000000005,273.3945933333334,46.38594933555556]
["Déchets/Résidus d'industrie","IAA végétales","Amidonnerie Autres",null,null,"Déchets d'industrie (IAA végétales)",0.569023076923077,0.9242526315789473,338.32627282608695,0.7043,49.054899999999996,0.05194,6.690466666666667,3.31375,236.66448432388668,312.69894799180776,177.93291753690767]
["Déchets/Résidus d'industrie","IAA végétales","Sucrerie Pulpes betterave, bétaïne",null,null,"Déchets d'industrie (IAA végétales)",0.326875,0.9120222222222222,313.1893038319603,0.51,14.26575,0,3.085,6.80825,134.15276874999998,285.6356048570551,93.36713833764989]
["Déchets/Résidus d'industrie","IAA végétales","Sucrerie Autres déchets",null,null,"Déchets d'industrie (IAA végétales)",0.677142857142857,0.8309000000000001,359.8439027777778,0.51,14.26575,0,3.085,6.80825,253.1871,298.99429881805565,202.46185377108338]
["Déchets/Résidus d'industrie","IAA végétales","Autres déchets céréaliers (pulpe, farine, gluten…)",null,null,"Déchets d'industrie (IAA végétales)",0.6236666666666667,0.7981164021164022,257.10940227317263,0.6,49.054899999999996,0.05194,6.690466666666667,3.31375,223.99136825396832,205.20323109256327,127.97841512472863]
["Déchets/Résidus d'industrie","IAA végétales","Transformation/conserverie des fruits et légumes",null,null,"Déchets d'industrie (IAA végétales)",0.18915942857142856,0.8628173700467425,307.8341226484413,0.6029,5.180963333333333,0.2525833333333333,2.8631546296296295,4.016843518518519,73.4445183057951,265.6046281141745,50.241619680004035]
["Déchets/Résidus d'industrie","IAA végétales","Coques de noix",null,null,"Déchets d'industrie (IAA végétales)",0.9053333333333334,0.851,229.35,0.5426,17.553819642857146,0,7.314285714285714,5.814285714285715,346.6974,195.17685,176.70010820000002]
["Déchets/Résidus d'industrie","Autres industries","Glycérine brute",null,null,"Déchets d'industrie (IAA autres)",1,0.935,734,0.54,0,0,0,0,{"$f":"G86*H86*0.45*1000","v":420.75},686.2900000000001,686.2900000000001,"Incinération",{"$f":"'BDD export Ecoinvent - SIMAPRO'!$Y$8","v":0.0400883},{"$f":"'BDD export Ecoinvent - SIMAPRO'!$Y$9","v":0.0379757},{"$f":"'BDD export Ecoinvent - SIMAPRO'!$Y$10","v":{"v":0.06944444444444445,"d":"6.94E-02"}}]
["Déchets/Résidus d'industrie","Autres industries","Résidus d'industrie chimique",null,null,"Déchets d'industrie (IAA autres)",0.3737714285714286,0.6766800000000001,719,0.6442,6.80507142857143,0.01104,3.120833333333333,4.386,113.81564262857145,486.53292000000005,181.8521045554286,"Incinération",{"$f":"'BDD export Ecoinvent - SIMAPRO'!$Y$8","v":0.0400883},{"$f":"'BDD export Ecoinvent - SIMAPRO'!$Y$9","v":0.0379757},{"$f":"'BDD export Ecoinvent - SIMAPRO'!$Y$10","v":{"v":0.06944444444444445,"d":"6.94E-02"}}]

{"sheet":"BDD export Ecoinvent - SIMAPRO","index":23,"n_rows":62,"n_cols":27,"rows_kept":62,"hidden":true,"merged":[[3,12,3,13],[3,14,3,15],[11,12,11,13],[11,14,11,15],[21,2,22,2]]}
[]
[{"$nulls":4},"Ecoinvent ou agribalyse : phytosanitaire par défaut ?",null,"N P K minérale à sortir"]
[{"$nulls":4},"Production électrique alternative (photovoltaique, géothermie)",{"$nulls":7},"Associé à 0,073020578065105 kg de GN qui entre dans la chaudière pour fournir 1kWh de chaleur",{"$nulls":3},"Substitution","Conso","Conso"]
[null,null,"Nom inventaire","Combustion de diesel en tracteur","Production diesel","Transport camion","Fertilisant N"," Fertilisant P"," Fertilisant K","Pesticides RER","Pesticides GLO","Irrigation","Chaleur (GN fossile adapté)",null,"Chaleur (biogénique adapté de fossile)",null,"Electricité FR","Electricité FR","Photovoltaïque DIGES","Eau potable FR","Tétrahydrothiophène : Chemical moyen","CO2 gaz liquide","Charbon actif","Infrastructure méthanisation","Traitement des biodéchets par incinération","STEP","Enfouissements"]
[null,null,"Nom inventaire sous simapro / Ecoinvent",null,null,"Transport, freight, lorry 7.5-16 metric ton, euro5 {RER}| market for transport, freight, lorry 7.5-16 metric ton, EURO5 | Cut-off, U",{"$nulls":5},"Irrigation {FR}| market for | Cut-off, U","Heat, central or small-scale, natural gas {Europe without Switzerland}| heat production, natural gas, at boiler condensing modulating <100kW | Cut-off, U ",null,"Heat, central or small-scale, natural gas {Europe without Switzerland}| heat production, natural gas, at boiler condensing modulating <100kW | Cut-off, U ",null,null,"Electricity, medium voltage {FR}| market for | Cut-off, U","Adapté de \"Electricity, low voltage {FR}| market for | Cut-off, U\"",null,"Chemical, organic {GLO}| market for |"]
[null,null,"Ou Agribalyse 3.1 .1 ?","Diesel combustion, in tractor {FR} U","Diesel {Europe without Switzerland}| market for | Cut-off, S - Copied from Ecoinvent U","Transport, freight, lorry 7.5-16 metric ton, EURO5 {RER}| transport, freight, lorry 7.5-16 metric ton, EURO5 | Cut-off, S - Copied from Ecoinvent U","Average mineral fertilizer, as N, at regional storehouse {FR} U","Average mineral fertilizer, as P2O5, at regional storehouse {FR} U","Average mineral fertilizer, as K2O, at regional storehouse {FR} U","Pesticide, unspecified {RER}| production | Cut-off, U","Pesticide, unspecified {GLO}| market for | Cut-off, U","Irrigation {FR}| market for | Cut-off, S - Copied from Ecoinvent U","Heat, central or small-scale, natural gas {Europe without Switzerland}| heat production, natural gas, at boiler condensing modulating <100kW | Cut-off, S - Copied from Ecoinvent U",null,"Heat, central or small-scale, natural gas {Europe without Switzerland}| heat production, natural gas, at boiler condensing modulating <100kW | Cut-off, S - Copied from Ecoinvent U",null,"Electricity, high voltage {FR}| production mix | Cut-off, S - Copied from Ecoinvent U","Electricity, medium voltage {FR}| market for | Cut-off, S - Copied from Ecoinvent U","Adapté de \"Electricity, low voltage {FR}| market for | Cut-off, S - Copied from Ecoinvent U\"","Water, municipal {FR} U","Chemical, organic {GLO}| market for | Cut-off, S - Copied from Ecoinvent U","Carbon dioxide, liquid {RER}| market for | Cut-off, S - Copied from Ecoinvent U","Activated carbon, granular {GLO}| market for activated carbon, granular | Cut-off, S - Copied from Ecoinvent U","Anaerobic digestion plant, agriculture, with methane recovery {RoW}| construction | Cut-off, S - Copied from Ecoinvent U","Biowaste {GLO}| treatment of biowaste, municipal incineration | Cut-off, S - Copied from Ecoinvent U","Treatment, sewage, to wastewater treatment {CH} U","Municipal solid waste {CH}| treatment of, sanitary landfill | Cut-off, S - Copied from Ecoinvent U"]
[null,null,"Unité","kg","kg","t.km","kg","kg","kg","kg","kg","m3","kWh (produit)","kg (brûlé)","kWh (produit)","kg (brûlé)","kWh","kWh","kWh","kg","kg","kg","kg","p","kg","m3","kg"]
[null,null,"CC 20 ans (kg CO2éq)",3.16,{"$f":"0.549+0.00084+0.000168","v":0.5500079999999999},{"$f":"0.22+0.000203+0.000103","v":0.220306},{"$f":"3.93+0.00878+0.00348","v":3.94226},{"$f":"1.05+0.0046+0.0155","v":1.0701},{"$f":"0.85+0.0037+0.000509","v":0.854209},{"$f":"9.83+0.0466+0.01","v":9.8866},{"$f":"11.4+0.0447+0.0119","v":11.456600000000002},{"$f":"0.0841+0.000318+0.0000373","v":0.0844553},{"$f":"0.314+0.0000914+0.0000172","v":0.3141086},{"$f":"M8/0.073020578065105","v":4.301644937950798},{"$f":"0.0027+0.000585+0.00000686","v":0.00329186},{"$f":"O8/0.073020578065105","v":0.04508126458633325},{"$f":"0.0722+0.000516+0.0000177","v":0.0727337},{"$f":"0.0849+0.000718+0.0000447","v":0.0856627},{"$f":"0.0984+0.000894","v":{"v":0.09929400000000001,"d":"9.93E-02"}},{"$f":"0.000357+0.00000303+0.000000579","v":{"v":0.000360609,"d":"3.61E-04"}},{"$f":"2.57+0.00686+0.000989","v":2.577849},{"$f":"1.31+0.00296+0.000507","v":1.3134670000000002},{"$f":"3.83+0.00512+0.00199","v":3.83711},{"$f":"102000+2300+186","v":104486},{"$f":"0.0399+0.000169+0.0000193","v":0.0400883},{"$f":"0.371+0.0428+0.000172","v":0.413972},{"$f":"0.104+1.67+0.0000259","v":1.7740259}]
[null,null,"CC 100 ans (kg CO2éq)",3.16,{"$f":"0.476+0.000283+0.000166","v":0.47644899999999996},{"$f":"0.212+0.0000685+0.000102","v":0.21217049999999998},{"$f":"3.55+0.00296+0.00341","v":3.55637},{"$f":"0.96+0.00155+0.0151","v":0.97665},{"$f":"0.776+0.00125+0.000504","v":0.777754},{"$f":"8.36+0.0157+0.00995","v":8.38565},{"$f":"9.64+0.015+0.0118","v":9.6668},{"$f":"0.0771+0.000107+0.000037","v":0.077244},{"$f":"0.254+0.0000308+0.000017","v":0.2540478},{"$f":"M9/0.073020578065105","v":3.479126113922181},{"$f":"0.00247+0.000197+0.00000676","v":2.6737600000000003E-3},{"$f":"O9/0.073020578065105","v":0.03661652743444569},{"$f":"0.0664+0.000174+0.0000175","v":0.0665915},{"$f":"0.0787+0.000242+0.0000447","v":0.0789867},{"$f":"0.0861+0.000301","v":{"v":0.08640099999999999,"d":"8.64E-02"}},{"$f":"0.000322+0.00000102+0.000000577","v":{"v":0.000323597,"d":"3.24E-04"}},{"$f":"1.98+0.00231+0.000977","v":1.983287},{"$f":"0.734+0.000995+0.000506","v":0.735501},{"$f":"3.3+0.00172+0.00196","v":3.30368},{"$f":"91500+774+181","v":92455},{"$f":"0.0379+0.0000569+0.0000188","v":0.0379757},{"$f":"0.344+0.0144+0.00017","v":0.35857},{"$f":"0.0528+0.561+0.0000256","v":0.6138256}]
[null,null,"Ressources fossiles et nucléaire (kWh)",null,{"$f":"E11/3.6","v":{"v":13.972222222222221,"d":"13.97"}},{"v":0.888888888888889,"d":"0.89"},{"$f":"G11/3.6","v":{"v":17.27777777777778,"d":"17.28"}},{"v":4.388888888888889,"d":"4.39"},{"v":3.194444444444444,"d":"3.19"},{"v":42.77777777777778,"d":"42.78"},{"$f":"K11/3.6","v":{"v":42.22222222222222,"d":"42.22"}},{"v":0.8083333333333333,"d":"0.81"},{"v":1.1111111111111112,"d":"1.11"},{"v":15.21641077834863,"d":"15.22"},{"v":0.036111111111111115,"d":"0.04"},{"v":0.4945333502963305,"d":"0.49"},{"v":3.1111111111111107,"d":"3.11"},{"v":3.194444444444444,"d":"3.19"},{"v":0.3972222222222222,"d":"0.40"},{"$f":"T11/3.6","v":{"v":1.5749999999999998E-3,"d":"1.58E-03"}},{"v":16.166666666666668,"d":"1.62E+01"},{"v":2.1555555555555554,"d":"2.16E+00"},{"v":10.972222222222221,"d":"1.10E+01"},{"v":286111.1111111111,"d":"2.86E+05"},{"v":0.06944444444444445,"d":"6.94E-02"},{"v":0.9361111111111111,"d":"9.36E-01"},{"v":0.0938888888888889,"d":"9.39E-02"}]
[null,null,"Ressources fossiles et nucléaire (MJ)",null,50.3,3.2,62.2,15.8,11.5,154,152,2.91,4,{"$f":"M11/0.073020578065105","v":54.77907880205507},0.13,{"$f":"O11/0.073020578065105","v":1.7803200610667897},11.2,11.5,1.43,{"v":0.00567,"d":"5.67E-03"},58.2,7.76,39.5,{"$f":"1030000","v":1030000},{"$f":"0.25","v":0.25},3.37,0.338]
[null,null,"Etapes qui vont utiliser cet ICV","Impact ITK","Impact ITK","Transport substrats et digestats","Evitement de fertilisant","Evitement de fertilisant","Evitement de fertilisant","Impact ITK","Impact ITK","Impact ITK","Evitements de consommations thermiques (émissions évitées)",null,"Consommations thermiques (émissions)",null,"Consommations électriques et évitements de consommations électriques","Consommations électriques et évitements de consommations électriques","Consommations électriques","Epuration d'air, autre ?","Poste d'injection du GN dans les réseaux (0,0275g/Nm3 de biométhane)","Substitution à la production de CO2 liquide","Epuration membranaire (0,15g/Nm3 de biogaz) Gesti'métha","Prise en compte de l'impact de la construction du méthaniseur","Traitement de référence des déchets ?","Traitement de référence des déchets (substrats graisseux)","Traitement de référence des déchets"]
[{"$nulls":23},"Peu de données sur AGB"]
[{"$nulls":23},"Procédé qui appelle 3,36311842881788E-08 pièce de méthaniseur /m3 de biogaz"]
[null,null,"Adaptation des données EcoInvent pour les panneaux photovoltaïques"]
[null,null,"Electricity, low voltage {FR}| electricity production, photovoltaic, 3kWp slanted-roof installation, multi-Si, panel, mounted | Cut-off, U",0.0143082467520936,{"$f":"(D16/D19)*100","v":{"v":41.18616144118612,"d":"41.19"}},"Agribalyse: donnée RoW (Electricity, low voltage {RoW}| electricity production, photovoltaic, 3kWp slanted-roof installation, multi-Si, panel, mounted | Cut-off, S - Copied from Ecoinvent U)"]
[null,null,"Electricity, low voltage {FR}| electricity production, photovoltaic, 3kWp slanted-roof installation, single-Si, panel, mounted | Cut-off, U",0.011503830400634,{"$f":"(D17/D19)*100","v":{"v":33.11367383311376,"d":"33.11"}}]
[null,null,"Electricity, low voltage {FR}| electricity production, photovoltaic, 570kWp open ground installation, multi-Si | Cut-off, U",0.0089283459685817,{"$f":"(D18/D19)*100","v":{"v":25.70016472570012,"d":"25.70"}}]
[{"$nulls":3},{"$f":"SUM(D16:D18)","v":0.034740423121309295},{"$f":"SUM(E16:E18)","v":100}]
[]
[null,null,"Facteurs d'émission (kg de C02 eq/kg de gaz émis)"]
[null,null,"Gaz émis","DIGES 2 : ","GWP à horizon ","GWP à horizon"]
[{"$nulls":3},"GWP à horizon 100 ans","20 ans","100 ans",null,"Légende :"]
[null,null,"IPCC",2007,2021,2021,null,"Sources des données","Référence"]
[null,null,"CO2 fossile",1,1,1,null,"Cellule verte","Cellule dont la valeur numérique est utilisée et modifiable"]
[null,null,"CO2 biogénique",0,0,0,null,"Cellule vert clair","Résultats d'impacts calculés"]
[null,null,"CO2 capté dans SOC",0,-1,-1,null,"Cellule orange","Cellule remplie par une formule qui utilisée et modifiable"]
[null,null,"CH4 fossile",25,82.5,29.8,null,"Cellule rouge","Cellule non utilisé dans le reste du calculateur"]
[null,null,"CH4 biogénique",25,80.8,27.2]
[null,null,"N2O",298,273,273]
[]
[]
[null,null,"Facteur d'impact pour 1 unité de fertilisant minéral épandue"]
[{"$nulls":3},"N (kg)","P2O5 (kg) - exporté","K2O (kg) - exporté"]
[null,null,"kg d'équivalent fertilisant évité",1,1,1]
[null,null,"kg eq CO2 20 ans",{"$f":"D35*'BDD export Ecoinvent - SIMAPRO'!$G$8","v":3.94226},{"$f":"E35*'BDD export Ecoinvent - SIMAPRO'!$H$8","v":1.0701},{"$f":"F35*'BDD export Ecoinvent - SIMAPRO'!$I$8","v":0.854209}]
[null,null,"kg eq CO2 100 ans",{"$f":"D35*'BDD export Ecoinvent - SIMAPRO'!$G$9","v":3.55637},{"$f":"E35*'BDD export Ecoinvent - SIMAPRO'!$H$9","v":0.97665},{"$f":"F35*'BDD export Ecoinvent - SIMAPRO'!$I$9","v":0.777754}]
[null,null,"Ressources fossiles et nucléaires (kWh eq)",{"$f":"D35*'BDD export Ecoinvent - SIMAPRO'!$G$10","v":17.27777777777778},{"$f":"E35*'BDD export Ecoinvent - SIMAPRO'!$H$10","v":4.388888888888889},{"$f":"F35*'BDD export Ecoinvent - SIMAPRO'!$I$10","v":3.194444444444444}]
[]
[null,null,"Emissions de NH3 et NOx (IPCC, 2019)",{"$f":"D35*'BDD modélisation ICV'!$E$109","v":0.11}]
[null,null,"Emissions de N2O indirect (via NH3 et Nox)",{"$f":"D40*'BDD modélisation ICV'!$E$110","v":0.0011}]
[]
[null,null,"Lessivage de N-NO3-",{"$f":"D35*'BDD modélisation ICV'!$E$111","v":0.24}]
[null,null,"Emissions de N-N2O indirect (via NO3-)",{"$f":"D43*'BDD modélisation ICV'!$E$112","v":2.6399999999999996E-3}]
[]
[null,null,"Emissions directes de N-N2O",{"$f":"D35*'BDD modélisation ICV'!$E$113","v":0.016}]
[]
[null,null,"Emissions totales de N-N2O",{"$f":"D41+D44+D46","v":0.01974}]
[null,null,"kg eq CO2 20 ans",{"$f":"D48/28*44*FC_N2O20","v":8.46846}]
[null,null,"kg eq CO2 100 ans",{"$f":"D48/28*44*FC_N2O100","v":8.46846}]
[]
[]
[null,null,"Nombre d'hectare fertilisé en azote à une dose de 170 UN / ha",{"$f":"D35/170","v":5.8823529411764705E-3}]
[null,null,"L de diesel non consommé pour l'azote minéral",{"$f":"D53*'BDD ITK culture'!$I$13","v":0.00611764705882353}]
[null,null,"kg de diesel non consommé pour l'azote minéral",{"$f":"D54*'BDD modélisation ICV'!$A$135","v":0.00507764705882353}]
[null,null,"kg eq CO2 20 ans",{"$f":"D55*('BDD export Ecoinvent - SIMAPRO'!$D$8+'BDD export Ecoinvent - SIMAPRO'!$E$8)","v":0.018838111209411767}]
[null,null,"kg eq CO2 100 ans",{"$f":"D56*('BDD export Ecoinvent - SIMAPRO'!$D$8+'BDD export Ecoinvent - SIMAPRO'!$E$8)","v":0.06988954329180734}]
[null,null,"Ressources fossiles et nucléaires (kWh eq)",{"$f":"D57*('BDD export Ecoinvent - SIMAPRO'!$D$8+'BDD export Ecoinvent - SIMAPRO'!$E$8)","v":0.2592907647289516}]
[null,null,"Total :"]
[null,null,"kg eq CO2 20 ans",{"$f":"D36+D49+D56","v":12.429558111209413},1.0701,0.854209]
[null,null,"kg eq CO2 100 ans",12.094719543291808,0.97665,0.777754]
[null,null,"Ressources fossiles et nucléaires (kWh eq)",17.53706854250673,4.388888888888889,3.194444444444444]

{"sheet":"Feuille de calcul Flux de matiè","index":24,"n_rows":32,"n_cols":7,"rows_kept":32,"hidden":true,"merged":[[1,2,2,2],[1,3,1,4],[12,3,13,3],[12,4,13,4],[12,5,13,5],[21,3,21,4],[22,2,25,2],[22,3,22,4],[23,3,25,3],[26,2,28,2],[26,3,28,3],[29,2,31,2],[29,3,31,3]]}
["DIGES 2"]
["N2O (t éq.CO2) = tonnage (MB) x N (kg/tMB) x FE (%N) x facteurs de conversion",null,"Sysmétha","Taux de capture phase solide"]
["CH4 (t éq.CO2) = tonnage (MB) x Potentiel Méthanogène (m3CH4 / tMB) x FE (% Pot. Méth.) x facteurs de conversion",null,null,"Centrifugeuse","Presse à vis"]
["Masse de C-CH4 = (B0 / 22,4L.mol-1) * 12 g.mol-1",null,"MB",{"v":0.29,"d":"29%"},{"v":0.1,"d":"10%"}]
["Masse de H-CH4 = (B0 / 22,4L.mol-1) * 4*1 g.mol-1  ",null,"MS",{"v":0.81,"d":"81%"},{"v":0.32,"d":"32%"}]
["Masse de C-CO2 = (B0 / 22,4L.mol-1) * 12 g.mol l-1 * 2/3",null,"MO",{"v":0.83,"d":"83%"},{"v":0.38,"d":"38%"}]
["Masse de O-CO2 = (B0 / 22,4L.mol-1) * 2*16 g.mol l-1 * 2/3  ",null,"Norg",{"v":0.78,"d":"78%"},{"v":0.19,"d":"19%"}]
["MO_biod/MO en %= ((B0 * 12/22,4) + (2/3 * B0 * 12/22,4) + (B0 * 4/22,4) + (B0 * 32 /22,4)) /1000 * 78%",null,"NH4+",{"v":0.29,"d":"29%"},{"v":0.1,"d":"10%"}]
["Quantités de C en t éq CO2 (transport des substrats) =∑ substrat (arrondisup (tonnage/11.62) * 2 * dist * FE CO2 km)",null,"P",{"v":0.92,"d":"92%"},{"v":0.28,"d":"28%"}]
["Quantités de C en t éq CO2 = ∑substrat (arrondisup((tonnage - tonnage* MO_biod/MO * %MO/MB)  / 11.62) * 2 * dist * FE CO2km",null,"K",{"v":0.45,"d":"45%"},{"v":0.11,"d":"11%"}]
["FE_post-stockage_digestat_CH4 = FEstockage_lisier_brut_CH4 * 33,2/100 * 30/80"]
["FE_Epandage_CH4 = (1-∑(FE_précédents)*B0) * 0,0004"]
["Quantité de méthane valorisable énergétiquement (m3 CH4) = (CH4 produit digesteur + CH4 récupéré pré-stockage + CH4 récupéré post-stockage) = (t * Pot.Méth.* FECH4meth dig) + (t * Pot.Méth.* FECH4meth pré-s* %CH4récup.Pré-st.) + (t * Pot.Méth * FE CH4 meth post-s* % CH4 récup.Post-st.)",null,"Sysmétha","Stockage phase solide","Stockage phase liquide avec couverture","Stockage Digestat Brut"]
["Energie électrique (E élec. en kWh) = énergie primaire * Rdt élect. = (CH4 valorisable * 9,94kWh/m3 * 95%) * 30%"]
["Energie thermique (E therm en kWh) = énergie primaire * Rdt therm. = (CH4 valorisable * 9,94kWh/m3 * 95%) * 35%",null,"MS",{"v":0.3,"d":"30%"},{"v":0.04,"d":"4%"},{"v":0.04,"d":"4%"}]
[null,null,"MV",{"v":0.36,"d":"36%"},{"v":0.05,"d":"5%"},{"v":0.05,"d":"5%"}]
[null,null,"Ntot",{"v":0.09,"d":"9%"},{"v":0.03,"d":"3%"},{"v":0.03,"d":"3%"}]
[null,null,"NH4+",{"v":0.81,"d":"81%"},{"v":0.05,"d":"5%"},{"v":0.05,"d":"5%"}]
[null,null,"COT",{"v":0.39,"d":"39%"},{"v":0.05,"d":"5%"},{"v":0.05,"d":"5%"}]
[]
[]
[null,null,"Type emission","Origine emission",null,"Facteur d'emission","Par rapport à …"]
[null,null,"Methane","digesteur",null,{"v":0.05,"d":"5%"},"la production totale de biogaz"]
[{"$nulls":3},"Stockage","Digestat brut",{"v":0.03,"d":"3%"},"du carbone biodegradé"]
[{"$nulls":4},"Phase liquide",{"v":0.03,"d":"3%"},"du carbone biodegradé"]
[{"$nulls":4},"Phase solide",{"v":0,"d":"0%"},"du carbone biodegradé"]
[null,null,"Ammoniac","Stockage","Digestat brut",{"v":0.05,"d":"5%"},"de l'azote ammoniacal"]
[{"$nulls":4},"Phase liquide",{"v":0.05,"d":"5%"},"de l'azote ammoniacal"]
[{"$nulls":4},"Phase solide",{"v":0.01,"d":"1%"},"de l'azote ammoniacal biodegradé"]
[null,null,"N2O","Stockage","Digestat brut",{"v":0,"d":"0%"},"de l'azote total biodegradé"]
[{"$nulls":4},"Phase liquide",{"v":0,"d":"0%"},"de l'azote total biodegradé"]
[{"$nulls":4},"Phase solide",{"v":0.05,"d":"5%"},"de l'azote total biodegradé"]

{"sheet":"Tableau indicateurs","index":25,"n_rows":54,"n_cols":5,"rows_kept":54,"hidden":true,"merged":[[26,1,26,3],[27,1,27,3],[31,2,31,3],[32,1,32,3],[33,2,33,3],[34,2,34,3],[35,2,35,3],[36,2,36,3],[37,2,37,3],[38,1,38,3],[39,2,39,3],[40,2,40,3],[41,2,41,3],[42,2,42,3],[43,1,43,3],[44,2,44,3],[45,2,45,3],[46,2,46,3],[47,2,47,3],[48,1,48,3],[49,2,49,3],[50,2,50,3],[51,2,51,3],[52,2,52,3],[53,2,53,3]]}
["Actions correctives"]
[null,"Catégorie","Action corrective","Avis du COTEC"]
[null,"Substrats cultivés","Evaluer l’usage du biométhane par les tracteurs (si épuration/injection)"]
[null,null,"Evaluer les possibilités de réduction de la fertilisation minérale et d’augmentation de la fertilisation organique"]
[null,"Transports","Déterminer le ou les substrats qui influence cette contribution, rechercher un gisement plus proche"]
[null,null,"Recherche de levier pour optimiser les distances de collecte"]
[null,null,"Recherche de levier pour optimiser les distances de transport des digestats"]
[null,"Méthanisation","Torchère automatique"]
[null,null,"Passage annuel d'une caméra IR"]
[null,null,"Passage fréquent d'un renifleur de méthane"]
[null,null,"Bonne gestion de l'alimentation du digesteur"]
[null,null,"Suivi très régulier des soupapes"]
[null,null,"Ronde journalière sur les éléments clés"]
[null,null,"Maintenance des soupapes et graissage des passages de câbles"]
[null,null,"Présence d’un post-digesteur"]
[null,null,"Mise en place d’une technologie de captage du CO2"]
[null,"Digestat","Couverture du digestat brut et liquide"]
[null,null,"Récupération du biogaz résiduel pour la couverture du digestat brut liquide"]
[null,null,"Séparation du digestat ?"]
[null,null,"Améliorer le matériel d’épandage (favoriser l’enfouisseur)"]
[null,"Valorisation du biogaz","Epurateur membranaire"]
[null,null,"Améliorer le taux de valorisation de l’énergie thermique"]
[null,null,"Evaluer la pertinence de la mise en place d’un oxydateur thermique (si épuration/injection)"]
[null,null,"Evaluer une double valorisation du biogaz de la cogé à l’injection"]
[]
["Indicateur de pratiques culturales, de biodiversité et d’économie circulaire"]
[null,"Gestion des cultures – Méthanisation Agricole"]
[null,"Proportion de substrats cultivés"]
[null,"Cultures principales","% tonnage","% SAU"]
[null,"CIVE été","% tonnage","% SAU"]
[null,"CIVE hiver","% tonnage","% SAU"]
[null,"Prairies","% SAU"]
[null,"Gestion des CIVE"]
[null,"Irrigation","Oui/non"]
[null,"Pesticides","Oui/non"]
[null,"Fertilisation minérale","Oui/non"]
[null,"Techniques culturales simplifiés","Oui/non"]
[null,"Au moins une des CIVE est-elle cultivée avec au moins deux espèces végétales différentes ?","Oui/non"]
[null,"Exploitation"]
[null,"% de substitution engrais minéraux sur l'exploitation agricole","%"]
[null,"Les exploitations ont-t-elles obtenus une certification HVE niv. 3 ?","Oui/non"]
[null,"Les exploitations ont-t-elles obtenus une certification bio ?","Oui/non"]
[null,"Réalisation de bilans humiques et d'analyses de la qualité des sols ?","?",null,"Oui/Non ?"]
[null,"Economie circulaire et Intégration dans le Territoire"]
[null,"Périmètre moyen d'appro des Biodéchets","km autour de l'installation"]
[null,"Gouvernance locale","Oui/non"]
[null,"Financement local (collectivité, citoyen, entreprise)","% financement "]
[null,"Implication de la collectivité locale (ex: appro, vente d'énergie, concertation)","Faible à Forte"]
[null,"Biodiversité sur le site de méthanisation"]
[null,"Surface du site de méthanisation","ha"]
[null,"Installation du site de méthanisation sur une surface déjà artificialisée ?","Oui/non"]
[null,"% de surface imperméabilisée","%"]
[null,"L'intégration paysagère a-t-elle été prise en compte lors de la conception du projet ?","?"]
[null,"Linéaires de haies autour des installations","m"]

{"sheet":"List1","index":26,"n_rows":24,"n_cols":17,"rows_kept":24,"hidden":true}
["Biomasse agricole animale","Biomasse agricole végétale ","Déchets/Résidus de collectivité","Déchets/Résidus d'industrie"]
["Biomasse agricole animale","Effluents d'élevage"]
["Biomasse agricole végétale ","Cultures principales","Cultures principales déclassées","CIVE d'hiver","CIVE d'été","Déchets/Résidus","Déchets/Résidus de cultures"]
["Déchets/Résidus d'industrie","IAA","Papeterie","IAA animales","IAA Confiserie/chocolaterie/Pâtisserie","IAA végétales","Autres industries"]
["Déchets/Résidus de collectivité","Algues","Biodéchets","Déchets verts","Graisses/huiles usagées (HCU, HAU)","STEP/STEU"]
["Biomasse agricole animale_Effluents d'élevage","Bovin - Fumier","Bovin - Lisier veau","Bovin - Lisiers autres","Caprin - Fumiers autres","Cunicole - Lisier, crottes","Equin - Fumier","Ovin - Fumier accumulé","Ovin - Fumiers autres","Porcin - Autres","Porcin - Fécès, lisier frais","Porcin - Fumier frais","Volaille -  Fumier (autres), fientes","Volaille -  Fumier (terre battue)","Volaille -  Lisier"]
["Biomasse agricole végétale _Cultures principales","Betteraves","Céréales, ensilées, non ensilées","Oléoprotéagineux, ensilées, non ensilées","Fourrages, ensilés, non ensilés","Prairies temporaires, ensilées, non ensilées"]
["Biomasse agricole végétale _Cultures principales déclassées","Betteraves déclassées","Céréales déclassées, ensilées, non ensilées","Fourrages déclassés, ensilés, non ensilés","Autres ensilée, non ensilée"]
["Biomasse agricole végétale _CIVE d'hiver","Betteraves CIVE","Céréales immatures, ensilées, non ensilées","Oléoprotéagineux CIVE, ensilées, non ensilées","Fourrages CIVE, ensilés, non ensilés","Mélanges - Autres - Immatures , ensilée, non ensilée","Prairies permanentes (avec fertilisation chimique), ensilées, non ensilées"]
["Biomasse agricole végétale _CIVE d'été","Céréales immatures, ensilées, non ensilées","Oléoprotéagineux CIVE, ensilées, non ensilées","Fourrages CIVE, ensilés, non ensilés","Mélanges - Autres - Immatures , ensilée, non ensilée"]
["Biomasse agricole végétale _Déchets/Résidus","Aliments pour animaux (bétails)"]
["Biomasse agricole végétale _Déchets/Résidus de cultures","Semences déclassées","Graines","Issus de stockage - céréales","Issus de stockage - autres","Menues paille","Pailles","Résidus de séchage céréales ","Rafles, épis, spathes","Feuilles et fanes","Rejets aqueux"]
["Déchets/Résidus d'industrie_IAA","Boues d'IAA"]
["Déchets/Résidus d'industrie_Papeterie","Boues de papeterie"]
["Déchets/Résidus d'industrie_IAA animales","Babeurre frais, caséine","Crème, fromages, lait entier, petit lait","Lactose, lactoserum, lait écrémé","Autres déchets animaux issus d'abattoirs","Stercoraires","Graisses animales de flottation","Rejets aqueux de l'industrie du lait","Déchets de poissons"]
["Déchets/Résidus d'industrie_IAA Confiserie/chocolaterie/Pâtisserie","Pâtisserie","Boulangerie","Confiserie"]
["Déchets/Résidus d'industrie_IAA végétales","Industrie alcools et jus Lies de vin","Industrie alcools et jus Marc de fruits","Industrie alcools et jus Autres","Féculerie/ transformation de pomme de terre","Industrie des corps gras végétaux Autres","Industrie des corps gras végétaux Matières filtrantes","Industrie des corps gras végétaux Graisses issues de la production de margarine ; huiles alimentaires","Industrie des corps gras végétaux Tourteaux autres, sons","Meunerie et maïserie","Amidonnerie Eau de process d'amidonnerie","Amidonnerie Autres","Sucrerie Pulpes betterave, bétaïne","Sucrerie Autres déchets","Autres déchets céréaliers (pulpe, farine, gluten…)","Transformation/conserverie des fruits et légumes","Coques de noix"]
["Déchets/Résidus d'industrie_Autres industries","Glycérine brute","Résidus d'industrie chimique"]
["Déchets/Résidus de collectivité_Déchets verts","Autres déchets verts","Tontes de pelouse"]
["Déchets/Résidus de collectivité_Biodéchets","Déchets restauration","FFOM, marchés, GMS","Soupe de déconditionnement"]
["Déchets/Résidus de collectivité_Algues","Fraîches"]
["Déchets/Résidus de collectivité_Graisses/huiles usagées (HCU, HAU)","Graisses/huiles usagées (HCU, HAU)"]
["Déchets/Résidus de collectivité_STEP/STEU","Autres (Boues et eaux résiduaires)","Graisses de flottation"]
["Data Range: 'BDD caractérisation substrats'!$A$4:$C$87","Output Range: 'Description des substrats'!$E$13:$G$13",0,3,6,"19/09/2023 15:42:35 This data is the auxiliary data generated by Kutools Dynamic Drop-down List(update v27)","FF"]

{"sheet":"List","index":27,"n_rows":26,"n_cols":16,"rows_kept":26,"hidden":true}
["Biomasse agricole animale","Biomasse agricole végétale","Déchets/Résidus de collectivité","Déchets/Résidus d'industrie","Déchets/résidus industriels liquides"]
["Biomasse agricole animale","Effluents d'élevage"]
["Déchets/résidus industriels liquides","Autres déchets/résidus industriels liquides"]
["Déchets/Résidus d'industrie","IAA","Maritime","IAA animales","IAA viande","IAA Confiserie/chocolaterie/Pâtisserie","IAA végétales","Autres déchets/Résidus d'industrie"]
["Déchets/Résidus de collectivité","Déchets verts","Biodéchets","Algues","Autres déchets/Résidus de collectivité","STEP/STEU"]
["Biomasse agricole végétale","Cultures principales","Cultures principales déclassées","CIVES","Déchets/Résidus","Déchets/Résidus de cultures"]
["Biomasse agricole animale_Effluents d'élevage","Volaille - Lisier","Volaille - Fumier (terre battue)","Volaille - Fumier (autres), fientes","Cunicole - Lisier, crottes","Caprin - Fumier accumulé","Caprin - Fumier autres","Ovin - Fumier accumulé","Ovin - Fumier autres","Equin - Fumier","Porcin - Fumier frais","Porcin - Autres","Porcin - Fécès, lisier frais","Bovin - Lisier autres","Bovin - Lisier veau","Bovin - Purin, Fumier"]
["Déchets/résidus industriels liquides_Autres déchets/résidus industriels liquides","Éthanol utilisé dans le nettoyage/l'extraction du plasma sanguin","Ethanol utilisé dans l'extraction des ingrédients des plantes médicinales","Matieres de vidange"]
["Déchets/Résidus d'industrie_IAA","Boues","Graisses","Rejets acqueux"]
["Déchets/Résidus d'industrie_Maritime","Eaux usées"]
["Déchets/Résidus d'industrie_IAA animales","Babeurre frais, caséine","Crème, fromages, lait entier, petit lait","Lactose, lactoserum, lait écrémé"]
["Déchets/Résidus d'industrie_IAA viande","Autres","Stercoraires"]
["Déchets/Résidus d'industrie_IAA Confiserie/chocolaterie/Pâtisserie","Pâtisserie","Boulangerie","Confiserie"]
["Déchets/Résidus d'industrie_IAA végétales","Industrie alcools et jus - lies de vin","Industrie alcools et jus - marcs","Industrie alcools et jus - marcs de houblon","Féculerie/ transformation de pomme de terre","Industrie des corps gras végétaux","Meunerie et maïserie","Amidonnerie","Sucrerie","Transformation/conserverie des fruits et légumes"]
["Déchets/Résidus d'industrie_Autres déchets/Résidus d'industrie","Glycérine","Cosmétiques"]
["Déchets/Résidus de collectivité_Déchets verts","Autres","Tontes de pelouse","Feuillage sec "]
["Déchets/Résidus de collectivité_Biodéchets","Déchets restauration","FFOM, marchés, GMS","Soupe de déconditionnement"]
["Déchets/Résidus de collectivité_Algues","Fraîches","pipo","pas fraiche","Non fraîches"]
["Déchets/Résidus de collectivité_Autres déchets/Résidus de collectivité","Graisses/huiles usagées (HCU, HAU)"]
["Déchets/Résidus de collectivité_STEP/STEU","Autres","Graisses","Jus de compostage "]
["Biomasse agricole végétale_Cultures principales","Céréales - ensilée, non ensilée","Oléoprotéagineux - ensilée, non ensilée","Fourrages - ensilée, non ensilée","Autres - ensilée, non ensilée","Prairie temporaire - ensilée, non ensilée"]
["Biomasse agricole végétale_Cultures principales déclassées","Betterave","Céréales"]
["Biomasse agricole végétale_CIVES","Betterave - ensilée, non ensilée","Céréales - Matures","Oléoprotéagineux - Matures ; ensilée, non ensilée","Fourrages - Matures ; ensilée, non ensilée","Autres - Matures ; ensilée, non ensilée","Prairie permanente (avec fertilisation chimique)"]
["Biomasse agricole végétale_Déchets/Résidus","Aliments bétails"]
["Biomasse agricole végétale_Déchets/Résidus de cultures","Semences déclassées","Résidus huile de semences","Issus de stockage - Déchets de céréales (poussières et pailles)","Issus de stockage - Déchets de sortie de silo","Issus de stockage - Poussières de silo","Menues paille","Pailles","Bagasse","Résidus de séchage céréales ","Rafles, épis, spathes","Feuilles et fanes","Prairie permanente (hors fertilisation chimique) - uniquement si autorisé par région pour amélioration sol pour etre considéré comme déchet","Jus de silo","Sylviculture - Déchets/résidus liquides"]
["Data Range: 'BDD caractérisation substrats'!$A$4:$C$86","Output Range: Feuil2!$A$1:$C$1",0,3,7,"14/09/2023 15:22:27 This data is the auxiliary data generated by Kutools Dynamic Drop-down List(v27)","FF"]